Skocz do zawartości
alastis

Nie mogę uruchomić Vmware Player 14

Rekomendowane odpowiedzi

Witam wszystkich mam problem z uruchomieniem Vmvare player polecenie:

sh VMware-VIX-1.17.0-6661328.x86_64.bundle

Zadziałało bez najmniejszego problemu ale niestety podczas uruchomienia pojawiają się okienko

Cytuj

before you can run vmware several modules must be compiled and loaded into the running kernel

Podgląd vmware-6838.log

2017-12-13T22:00:58.544Z| vthread-1| I125: Log for VMware Workstation pid=5718 version=14.0.0 build=build-6661328 option=Release
2017-12-13T22:00:58.544Z| vthread-1| I125: The process is 64-bit.
2017-12-13T22:00:58.544Z| vthread-1| I125: Host codepage=UTF-8 encoding=UTF-8
2017-12-13T22:00:58.544Z| vthread-1| I125: Host is Linux 4.14.3-300.fc27.x86_64 Fedora release 27 (Twenty Seven)
2017-12-13T22:00:58.544Z| vthread-1| I125: DictionaryLoad: Cannot open file "/usr/lib/vmware/settings": No such file or directory.
2017-12-13T22:00:58.544Z| vthread-1| I125: [msg.dictionary.load.openFailed] Cannot open file "/usr/lib/vmware/settings": No such file or directory.
2017-12-13T22:00:58.544Z| vthread-1| I125: PREF Optional preferences file not found at /usr/lib/vmware/settings. Using default values.
2017-12-13T22:00:58.544Z| vthread-1| I125: DictionaryLoad: Cannot open file "/home/alastis/.vmware/config": No such file or directory.
2017-12-13T22:00:58.544Z| vthread-1| I125: [msg.dictionary.load.openFailed] Cannot open file "/home/alastis/.vmware/config": No such file or directory.
2017-12-13T22:00:58.544Z| vthread-1| I125: PREF Optional preferences file not found at /home/alastis/.vmware/config. Using default values.
2017-12-13T22:00:58.544Z| vthread-1| I125: DictionaryLoad: Cannot open file "/home/alastis/.vmware/preferences": No such file or directory.
2017-12-13T22:00:58.544Z| vthread-1| I125: [msg.dictionary.load.openFailed] Cannot open file "/home/alastis/.vmware/preferences": No such file or directory.
2017-12-13T22:00:58.544Z| vthread-1| I125: PREF Optional preferences file not found at /home/alastis/.vmware/preferences. Using default values.
2017-12-13T22:00:58.560Z| vthread-1| W115: Logging to /tmp/vmware-root/vmware-5718.log
2017-12-13T22:00:58.575Z| vthread-1| I125: Obtaining info using the running kernel.
2017-12-13T22:00:58.575Z| vthread-1| I125: Created new pathsHash.
2017-12-13T22:00:58.575Z| vthread-1| I125: Setting header path for 4.14.3-300.fc27.x86_64 to "/lib/modules/4.14.3-300.fc27.x86_64/build/include".
2017-12-13T22:00:58.575Z| vthread-1| I125: Validating path "/lib/modules/4.14.3-300.fc27.x86_64/build/include" for kernel release "4.14.3-300.fc27.x86_64".
2017-12-13T22:00:58.575Z| vthread-1| I125: Failed to find /lib/modules/4.14.3-300.fc27.x86_64/build/include/linux/version.h
2017-12-13T22:00:58.575Z| vthread-1| I125: /lib/modules/4.14.3-300.fc27.x86_64/build/include/linux/version.h not found, looking for generated/uapi/linux/version.h instead.
2017-12-13T22:00:58.575Z| vthread-1| I125: using /usr/bin/gcc for preprocess check
2017-12-13T22:00:58.586Z| vthread-1| I125: Preprocessed UTS_RELEASE, got value "4.14.3-300.fc27.x86_64".
2017-12-13T22:00:58.586Z| vthread-1| I125: The header path "/lib/modules/4.14.3-300.fc27.x86_64/build/include" for the kernel "4.14.3-300.fc27.x86_64" is valid.  Whoohoo!
2017-12-13T22:00:58.899Z| vthread-1| I125: found symbol version file /lib/modules/4.14.3-300.fc27.x86_64/build/Module.symvers
2017-12-13T22:00:58.899Z| vthread-1| I125: Reading symbol versions from /lib/modules/4.14.3-300.fc27.x86_64/build/Module.symvers.
2017-12-13T22:00:58.931Z| vthread-1| I125: Read 19116 symbol versions
2017-12-13T22:00:58.932Z| vthread-1| I125: Reading in info for the vmmon module.
2017-12-13T22:00:58.932Z| vthread-1| I125: Reading in info for the vmnet module.
2017-12-13T22:00:58.932Z| vthread-1| I125: Reading in info for the vmblock module.
2017-12-13T22:00:58.932Z| vthread-1| I125: Reading in info for the vmci module.
2017-12-13T22:00:58.932Z| vthread-1| I125: Reading in info for the vsock module.
2017-12-13T22:00:58.932Z| vthread-1| I125: Setting vsock to depend on vmci.
2017-12-13T22:00:58.932Z| vthread-1| I125: Invoking modinfo on "vmmon".
2017-12-13T22:00:58.936Z| vthread-1| I125: "/sbin/modinfo" exited with status 256.
2017-12-13T22:00:58.936Z| vthread-1| I125: Invoking modinfo on "vmnet".
2017-12-13T22:00:58.939Z| vthread-1| I125: "/sbin/modinfo" exited with status 0.
2017-12-13T22:00:58.939Z| vthread-1| I125: Invoking modinfo on "vmblock".
2017-12-13T22:00:58.942Z| vthread-1| I125: "/sbin/modinfo" exited with status 256.
2017-12-13T22:00:58.942Z| vthread-1| I125: Invoking modinfo on "vmci".
2017-12-13T22:00:58.945Z| vthread-1| I125: "/sbin/modinfo" exited with status 256.
2017-12-13T22:00:58.945Z| vthread-1| I125: Invoking modinfo on "vsock".
2017-12-13T22:00:58.950Z| vthread-1| I125: "/sbin/modinfo" exited with status 0.
2017-12-13T22:00:58.964Z| vthread-1| I125: to be installed: vmmon status: 0
2017-12-13T22:00:58.977Z| vthread-1| I125: Obtaining info using the running kernel.
2017-12-13T22:00:58.977Z| vthread-1| I125: Setting header path for 4.14.3-300.fc27.x86_64 to "/lib/modules/4.14.3-300.fc27.x86_64/build/include".
2017-12-13T22:00:58.977Z| vthread-1| I125: Validating path "/lib/modules/4.14.3-300.fc27.x86_64/build/include" for kernel release "4.14.3-300.fc27.x86_64".
2017-12-13T22:00:58.977Z| vthread-1| I125: Failed to find /lib/modules/4.14.3-300.fc27.x86_64/build/include/linux/version.h
2017-12-13T22:00:58.977Z| vthread-1| I125: /lib/modules/4.14.3-300.fc27.x86_64/build/include/linux/version.h not found, looking for generated/uapi/linux/version.h instead.
2017-12-13T22:00:58.977Z| vthread-1| I125: using /usr/bin/gcc for preprocess check
2017-12-13T22:00:58.987Z| vthread-1| I125: Preprocessed UTS_RELEASE, got value "4.14.3-300.fc27.x86_64".
2017-12-13T22:00:58.987Z| vthread-1| I125: The header path "/lib/modules/4.14.3-300.fc27.x86_64/build/include" for the kernel "4.14.3-300.fc27.x86_64" is valid.  Whoohoo!
2017-12-13T22:00:59.198Z| vthread-1| I125: found symbol version file /lib/modules/4.14.3-300.fc27.x86_64/build/Module.symvers
2017-12-13T22:00:59.198Z| vthread-1| I125: Reading symbol versions from /lib/modules/4.14.3-300.fc27.x86_64/build/Module.symvers.
2017-12-13T22:00:59.219Z| vthread-1| I125: Read 19116 symbol versions
2017-12-13T22:00:59.219Z| vthread-1| I125: Kernel header path retrieved from FileEntry: /lib/modules/4.14.3-300.fc27.x86_64/build/include
2017-12-13T22:00:59.219Z| vthread-1| I125: Update kernel header path to /lib/modules/4.14.3-300.fc27.x86_64/build/include
2017-12-13T22:00:59.219Z| vthread-1| I125: Validating path "/lib/modules/4.14.3-300.fc27.x86_64/build/include" for kernel release "4.14.3-300.fc27.x86_64".
2017-12-13T22:00:59.219Z| vthread-1| I125: Failed to find /lib/modules/4.14.3-300.fc27.x86_64/build/include/linux/version.h
2017-12-13T22:00:59.219Z| vthread-1| I125: /lib/modules/4.14.3-300.fc27.x86_64/build/include/linux/version.h not found, looking for generated/uapi/linux/version.h instead.
2017-12-13T22:00:59.219Z| vthread-1| I125: using /usr/bin/gcc for preprocess check
2017-12-13T22:00:59.230Z| vthread-1| I125: Preprocessed UTS_RELEASE, got value "4.14.3-300.fc27.x86_64".
2017-12-13T22:00:59.230Z| vthread-1| I125: The header path "/lib/modules/4.14.3-300.fc27.x86_64/build/include" for the kernel "4.14.3-300.fc27.x86_64" is valid.  Whoohoo!
2017-12-13T22:00:59.231Z| vthread-1| I125: Found compiler at "/usr/bin/gcc"
2017-12-13T22:00:59.237Z| vthread-1| I125: Got gcc version "7".
2017-12-13T22:00:59.237Z| vthread-1| I125: The GCC version matches the kernel GCC minor version like a glove.
2017-12-13T22:00:59.243Z| vthread-1| I125: Got gcc version "7".
2017-12-13T22:00:59.243Z| vthread-1| I125: The GCC version matches the kernel GCC minor version like a glove.
2017-12-13T22:00:59.244Z| vthread-1| I125: Trying to find a suitable PBM set for kernel "4.14.3-300.fc27.x86_64".
2017-12-13T22:00:59.244Z| vthread-1| I125: No matching PBM set was found for kernel "4.14.3-300.fc27.x86_64".
2017-12-13T22:00:59.244Z| vthread-1| I125: The GCC version matches the kernel GCC minor version like a glove.
2017-12-13T22:00:59.244Z| vthread-1| I125: Validating path "/lib/modules/4.14.3-300.fc27.x86_64/build/include" for kernel release "4.14.3-300.fc27.x86_64".
2017-12-13T22:00:59.244Z| vthread-1| I125: Failed to find /lib/modules/4.14.3-300.fc27.x86_64/build/include/linux/version.h
2017-12-13T22:00:59.244Z| vthread-1| I125: /lib/modules/4.14.3-300.fc27.x86_64/build/include/linux/version.h not found, looking for generated/uapi/linux/version.h instead.
2017-12-13T22:00:59.245Z| vthread-1| I125: using /usr/bin/gcc for preprocess check
2017-12-13T22:00:59.255Z| vthread-1| I125: Preprocessed UTS_RELEASE, got value "4.14.3-300.fc27.x86_64".
2017-12-13T22:00:59.255Z| vthread-1| I125: The header path "/lib/modules/4.14.3-300.fc27.x86_64/build/include" for the kernel "4.14.3-300.fc27.x86_64" is valid.  Whoohoo!
2017-12-13T22:00:59.257Z| vthread-1| I125: The GCC version matches the kernel GCC minor version like a glove.
2017-12-13T22:00:59.257Z| vthread-1| I125: Validating path "/lib/modules/4.14.3-300.fc27.x86_64/build/include" for kernel release "4.14.3-300.fc27.x86_64".
2017-12-13T22:00:59.257Z| vthread-1| I125: Failed to find /lib/modules/4.14.3-300.fc27.x86_64/build/include/linux/version.h
2017-12-13T22:00:59.257Z| vthread-1| I125: /lib/modules/4.14.3-300.fc27.x86_64/build/include/linux/version.h not found, looking for generated/uapi/linux/version.h instead.
2017-12-13T22:00:59.257Z| vthread-1| I125: using /usr/bin/gcc for preprocess check
2017-12-13T22:00:59.269Z| vthread-1| I125: Preprocessed UTS_RELEASE, got value "4.14.3-300.fc27.x86_64".
2017-12-13T22:00:59.269Z| vthread-1| I125: The header path "/lib/modules/4.14.3-300.fc27.x86_64/build/include" for the kernel "4.14.3-300.fc27.x86_64" is valid.  Whoohoo!
2017-12-13T22:00:59.269Z| vthread-1| I125: Using temp dir "/tmp".
2017-12-13T22:00:59.271Z| vthread-1| I125: Obtaining info using the running kernel.
2017-12-13T22:00:59.271Z| vthread-1| I125: Setting header path for 4.14.3-300.fc27.x86_64 to "/lib/modules/4.14.3-300.fc27.x86_64/build/include".
2017-12-13T22:00:59.271Z| vthread-1| I125: Validating path "/lib/modules/4.14.3-300.fc27.x86_64/build/include" for kernel release "4.14.3-300.fc27.x86_64".
2017-12-13T22:00:59.271Z| vthread-1| I125: Failed to find /lib/modules/4.14.3-300.fc27.x86_64/build/include/linux/version.h
2017-12-13T22:00:59.271Z| vthread-1| I125: /lib/modules/4.14.3-300.fc27.x86_64/build/include/linux/version.h not found, looking for generated/uapi/linux/version.h instead.
2017-12-13T22:00:59.271Z| vthread-1| I125: using /usr/bin/gcc for preprocess check
2017-12-13T22:00:59.282Z| vthread-1| I125: Preprocessed UTS_RELEASE, got value "4.14.3-300.fc27.x86_64".
2017-12-13T22:00:59.283Z| vthread-1| I125: The header path "/lib/modules/4.14.3-300.fc27.x86_64/build/include" for the kernel "4.14.3-300.fc27.x86_64" is valid.  Whoohoo!
2017-12-13T22:00:59.588Z| vthread-1| I125: found symbol version file /lib/modules/4.14.3-300.fc27.x86_64/build/Module.symvers
2017-12-13T22:00:59.588Z| vthread-1| I125: Reading symbol versions from /lib/modules/4.14.3-300.fc27.x86_64/build/Module.symvers.
2017-12-13T22:00:59.619Z| vthread-1| I125: Read 19116 symbol versions
2017-12-13T22:00:59.619Z| vthread-1| I125: Invoking modinfo on "vmmon".
2017-12-13T22:00:59.624Z| vthread-1| I125: "/sbin/modinfo" exited with status 256.
2017-12-13T22:00:59.746Z| vthread-1| I125: Setting destination path for vmmon to "/lib/modules/4.14.3-300.fc27.x86_64/misc/vmmon.ko".
2017-12-13T22:00:59.756Z| vthread-1| I125: Extracting the vmmon source from "/usr/lib/vmware/modules/source/vmmon.tar".
2017-12-13T22:00:59.801Z| vthread-1| I125: Successfully extracted the vmmon source.
2017-12-13T22:00:59.801Z| vthread-1| I125: Building module with command "/usr/bin/make -j4 -C /tmp/modconfig-N49bxg/vmmon-only auto-build HEADER_DIR=/lib/modules/4.14.3-300.fc27.x86_64/build/include CC=/usr/bin/gcc IS_GCC_3=no"
2017-12-13T22:01:04.787Z| vthread-1| W115: Failed to build vmmon.  Failed to execute the build command.
uname --r
4.14.3-300.fc27.x86_64

Wszelka pomoc mile widziana :)

 

a i jeszcze to:

[alastis@localhost ~]$ sudo su -      
[root@localhost ~]# vmware-modconfig --console --install-all
[AppLoader] GLib does not have GSettings support.
Zatrzymywanie vmware (przez systemctl):                    [  OK  ]
make: Wejście do katalogu '/tmp/modconfig-7RaPAH/vmmon-only'
Using kernel build system.
/usr/bin/make -C /lib/modules/4.14.3-300.fc27.x86_64/build/include/.. SUBDIRS=$PWD SRCROOT=$PWD/. \
  MODULEBUILDDIR= modules
make[1]: Wejście do katalogu '/usr/src/kernels/4.14.3-300.fc27.x86_64'
  CC [M]  /tmp/modconfig-7RaPAH/vmmon-only/linux/driverLog.o
  CC [M]  /tmp/modconfig-7RaPAH/vmmon-only/linux/driver.o
  CC [M]  /tmp/modconfig-7RaPAH/vmmon-only/linux/hostif.o
  CC [M]  /tmp/modconfig-7RaPAH/vmmon-only/common/memtrack.o
  CC [M]  /tmp/modconfig-7RaPAH/vmmon-only/common/apic.o
  CC [M]  /tmp/modconfig-7RaPAH/vmmon-only/common/hashFunc.o
  CC [M]  /tmp/modconfig-7RaPAH/vmmon-only/common/vmx86.o
In file included from /tmp/modconfig-7RaPAH/vmmon-only/./include/vm_asm.h:43:0,
                 from /tmp/modconfig-7RaPAH/vmmon-only/linux/hostif.c:60:
/tmp/modconfig-7RaPAH/vmmon-only/./include/x86msr.h:115:0: warning: "MSR_MISC_FEATURES_ENABLES" redefined
 #define MSR_MISC_FEATURES_ENABLES            0x140
 
In file included from ./arch/x86/include/asm/msr.h:5:0,
                 from ./arch/x86/include/asm/processor.h:21,
                 from ./arch/x86/include/asm/cpufeature.h:5,
                 from ./arch/x86/include/asm/thread_info.h:53,
                 from ./include/linux/thread_info.h:38,
                 from ./arch/x86/include/asm/preempt.h:7,
                 from ./include/linux/preempt.h:81,
                 from ./include/linux/rcupdate.h:40,
                 from ./include/linux/rculist.h:11,
                 from ./include/linux/pid.h:5,
                 from ./include/linux/sched.h:14,
                 from ./include/linux/binfmts.h:5,
                 from /tmp/modconfig-7RaPAH/vmmon-only/linux/hostif.c:32:
./arch/x86/include/asm/msr-index.h:572:0: note: this is the location of the previous definition
 #define MSR_MISC_FEATURES_ENABLES 0x00000140
 
  CC [M]  /tmp/modconfig-7RaPAH/vmmon-only/common/cpuid.o
In file included from /tmp/modconfig-7RaPAH/vmmon-only/./include/vm_asm_x86.h:41:0,
                 from /tmp/modconfig-7RaPAH/vmmon-only/./include/vm_asm_x86_64.h:40,
                 from /tmp/modconfig-7RaPAH/vmmon-only/./include/vm_asm.h:46,
                 from /tmp/modconfig-7RaPAH/vmmon-only/linux/hostif.c:60:
/tmp/modconfig-7RaPAH/vmmon-only/./include/x86_basic_defs.h:78:0: warning: "CR3_PCID_MASK" redefined
 #define CR3_PCID_MASK  0xFFF
 
In file included from ./arch/x86/include/asm/irqflags.h:5:0,
                 from ./include/linux/irqflags.h:16,
                 from ./include/linux/rcupdate.h:39,
                 from ./include/linux/rculist.h:11,
                 from ./include/linux/pid.h:5,
                 from ./include/linux/sched.h:14,
                 from ./include/linux/binfmts.h:5,
                 from /tmp/modconfig-7RaPAH/vmmon-only/linux/hostif.c:32:
./arch/x86/include/asm/processor-flags.h:39:0: note: this is the location of the previous definition
 #define CR3_PCID_MASK 0xFFFull
 
In file included from /tmp/modconfig-7RaPAH/vmmon-only/common/vmx86.h:32:0,
                 from /tmp/modconfig-7RaPAH/vmmon-only/common/vmx86.c:43:
/tmp/modconfig-7RaPAH/vmmon-only/./include/x86msr.h:115:0: warning: "MSR_MISC_FEATURES_ENABLES" redefined
 #define MSR_MISC_FEATURES_ENABLES            0x140
 
In file included from ./arch/x86/include/asm/msr.h:5:0,
                 from ./arch/x86/include/asm/processor.h:21,
                 from ./arch/x86/include/asm/cpufeature.h:5,
                 from ./arch/x86/include/asm/thread_info.h:53,
                 from ./include/linux/thread_info.h:38,
                 from ./arch/x86/include/asm/preempt.h:7,
                 from ./include/linux/preempt.h:81,
                 from ./include/linux/rcupdate.h:40,
                 from ./include/linux/rculist.h:11,
                 from ./include/linux/pid.h:5,
                 from ./include/linux/sched.h:14,
                 from /tmp/modconfig-7RaPAH/vmmon-only/common/vmx86.c:31:
./arch/x86/include/asm/msr-index.h:572:0: note: this is the location of the previous definition
 #define MSR_MISC_FEATURES_ENABLES 0x00000140
 
In file included from /tmp/modconfig-7RaPAH/vmmon-only/./include/vm_asm_x86.h:41:0,
                 from /tmp/modconfig-7RaPAH/vmmon-only/./include/vm_asm_x86_64.h:40,
                 from /tmp/modconfig-7RaPAH/vmmon-only/./include/vm_asm.h:46,
                 from /tmp/modconfig-7RaPAH/vmmon-only/common/vmx86.c:46:
/tmp/modconfig-7RaPAH/vmmon-only/./include/x86_basic_defs.h:78:0: warning: "CR3_PCID_MASK" redefined
 #define CR3_PCID_MASK  0xFFF
 
In file included from ./arch/x86/include/asm/irqflags.h:5:0,
                 from ./include/linux/irqflags.h:16,
                 from ./include/linux/rcupdate.h:39,
                 from ./include/linux/rculist.h:11,
                 from ./include/linux/pid.h:5,
                 from ./include/linux/sched.h:14,
                 from /tmp/modconfig-7RaPAH/vmmon-only/common/vmx86.c:31:
./arch/x86/include/asm/processor-flags.h:39:0: note: this is the location of the previous definition
 #define CR3_PCID_MASK 0xFFFull
 
In file included from /tmp/modconfig-7RaPAH/vmmon-only/./common/vmx86.h:32:0,
                 from /tmp/modconfig-7RaPAH/vmmon-only/linux/driver.h:32,
                 from /tmp/modconfig-7RaPAH/vmmon-only/linux/driver.c:47:
/tmp/modconfig-7RaPAH/vmmon-only/./include/x86msr.h:115:0: warning: "MSR_MISC_FEATURES_ENABLES" redefined
 #define MSR_MISC_FEATURES_ENABLES            0x140
 
In file included from ./arch/x86/include/asm/msr.h:5:0,
                 from ./arch/x86/include/asm/processor.h:21,
                 from ./arch/x86/include/asm/cpufeature.h:5,
                 from ./arch/x86/include/asm/thread_info.h:53,
                 from ./include/linux/thread_info.h:38,
                 from ./arch/x86/include/asm/preempt.h:7,
                 from ./include/linux/preempt.h:81,
                 from ./include/linux/spinlock.h:51,
                 from ./include/linux/wait.h:9,
                 from ./include/linux/wait_bit.h:8,
                 from ./include/linux/fs.h:6,
                 from ./include/linux/highmem.h:5,
                 from /tmp/modconfig-7RaPAH/vmmon-only/linux/driver.c:25:
./arch/x86/include/asm/msr-index.h:572:0: note: this is the location of the previous definition
 #define MSR_MISC_FEATURES_ENABLES 0x00000140
 
  CC [M]  /tmp/modconfig-7RaPAH/vmmon-only/common/task.o
In file included from /tmp/modconfig-7RaPAH/vmmon-only/./include/vm_asm_x86.h:41:0,
                 from /tmp/modconfig-7RaPAH/vmmon-only/./include/vm_asm_x86_64.h:40,
                 from /tmp/modconfig-7RaPAH/vmmon-only/./include/vm_asm.h:46,
                 from /tmp/modconfig-7RaPAH/vmmon-only/linux/driver.c:49:
/tmp/modconfig-7RaPAH/vmmon-only/./include/x86_basic_defs.h:78:0: warning: "CR3_PCID_MASK" redefined
 #define CR3_PCID_MASK  0xFFF
 
In file included from ./arch/x86/include/asm/processor.h:5:0,
                 from ./arch/x86/include/asm/cpufeature.h:5,
                 from ./arch/x86/include/asm/thread_info.h:53,
                 from ./include/linux/thread_info.h:38,
                 from ./arch/x86/include/asm/preempt.h:7,
                 from ./include/linux/preempt.h:81,
                 from ./include/linux/spinlock.h:51,
                 from ./include/linux/wait.h:9,
                 from ./include/linux/wait_bit.h:8,
                 from ./include/linux/fs.h:6,
                 from ./include/linux/highmem.h:5,
                 from /tmp/modconfig-7RaPAH/vmmon-only/linux/driver.c:25:
./arch/x86/include/asm/processor-flags.h:39:0: note: this is the location of the previous definition
 #define CR3_PCID_MASK 0xFFFull
 
/tmp/modconfig-7RaPAH/vmmon-only/linux/hostif.c: In function ‘HostIF_EstimateLockedPageLimit’:
/tmp/modconfig-7RaPAH/vmmon-only/linux/hostif.c:1519:31: error: implicit declaration of function ‘global_page_state’; did you mean ‘global_numa_state’? [-Werror=implicit-function-declaration]
    unsigned int lockedPages = global_page_state(NR_PAGETABLE) +
                               ^~~~~~~~~~~~~~~~~
                               global_numa_state
/tmp/modconfig-7RaPAH/vmmon-only/linux/driver.c:981:1: warning: always_inline function might not be inlinable [-Wattributes]
 LinuxDriverSyncReadTSCs(uint64 *delta) // OUT: TSC max - TSC min
 ^~~~~~~~~~~~~~~~~~~~~~~
In file included from ./arch/x86/include/asm/processor.h:5:0,
                 from ./arch/x86/include/asm/cpufeature.h:5,
                 from ./arch/x86/include/asm/thread_info.h:53,
                 from ./include/linux/thread_info.h:38,
                 from ./arch/x86/include/asm/preempt.h:7,
                 from ./include/linux/preempt.h:81,
                 from ./include/linux/spinlock.h:51,
                 from ./arch/x86/include/asm/mmu.h:5,
                 from ./arch/x86/include/asm/desc.h:7,
                 from /tmp/modconfig-7RaPAH/vmmon-only/common/task.c:70:
./arch/x86/include/asm/processor-flags.h:39:0: warning: "CR3_PCID_MASK" redefined
 #define CR3_PCID_MASK 0xFFFull
 
In file included from /tmp/modconfig-7RaPAH/vmmon-only/./include/vm_asm_x86.h:41:0,
                 from /tmp/modconfig-7RaPAH/vmmon-only/./include/vm_asm_x86_64.h:40,
                 from /tmp/modconfig-7RaPAH/vmmon-only/./include/vm_asm.h:46,
                 from /tmp/modconfig-7RaPAH/vmmon-only/common/task.c:53:
/tmp/modconfig-7RaPAH/vmmon-only/./include/x86_basic_defs.h:78:0: note: this is the location of the previous definition
 #define CR3_PCID_MASK  0xFFF
 
In file included from ./arch/x86/include/asm/msr.h:5:0,
                 from ./arch/x86/include/asm/processor.h:21,
                 from ./arch/x86/include/asm/cpufeature.h:5,
                 from ./arch/x86/include/asm/thread_info.h:53,
                 from ./include/linux/thread_info.h:38,
                 from ./arch/x86/include/asm/preempt.h:7,
                 from ./include/linux/preempt.h:81,
                 from ./include/linux/spinlock.h:51,
                 from ./arch/x86/include/asm/mmu.h:5,
                 from ./arch/x86/include/asm/desc.h:7,
                 from /tmp/modconfig-7RaPAH/vmmon-only/common/task.c:70:
./arch/x86/include/asm/msr-index.h:572:0: warning: "MSR_MISC_FEATURES_ENABLES" redefined
 #define MSR_MISC_FEATURES_ENABLES 0x00000140
 
In file included from /tmp/modconfig-7RaPAH/vmmon-only/common/vmx86.h:32:0,
                 from /tmp/modconfig-7RaPAH/vmmon-only/common/task.c:51:
/tmp/modconfig-7RaPAH/vmmon-only/./include/x86msr.h:115:0: note: this is the location of the previous definition
 #define MSR_MISC_FEATURES_ENABLES            0x140
 
  CC [M]  /tmp/modconfig-7RaPAH/vmmon-only/common/comport.o
  CC [M]  /tmp/modconfig-7RaPAH/vmmon-only/common/phystrack.o
/tmp/modconfig-7RaPAH/vmmon-only/common/vmx86.o: warning: objtool: Vmx86EnableHVOnCPU() falls through to next function Vmx86GetMSR()
  CC [M]  /tmp/modconfig-7RaPAH/vmmon-only/vmcore/moduleloop.o
/tmp/modconfig-7RaPAH/vmmon-only/common/phystrack.o: warning: objtool: PhysTrack_Free() falls through to next function PhysTrack_Add()
/tmp/modconfig-7RaPAH/vmmon-only/common/phystrack.o: warning: objtool: PhysTrack_Add() falls through to next function PhysTrack_Remove()
/tmp/modconfig-7RaPAH/vmmon-only/common/phystrack.o: warning: objtool: PhysTrack_Remove() falls through to next function PhysTrack_Test()
  CC [M]  /tmp/modconfig-7RaPAH/vmmon-only/bootstrap/monLoaderVmmon.o
cc1: some warnings being treated as errors
make[2]: *** [scripts/Makefile.build:315: /tmp/modconfig-7RaPAH/vmmon-only/linux/hostif.o] Błąd 1
make[2]: *** Oczekiwanie na niezakończone zadania....
/tmp/modconfig-7RaPAH/vmmon-only/common/task.o: warning: objtool: .text: unexpected end of section
In file included from /tmp/modconfig-7RaPAH/vmmon-only/./common/vmx86.h:32:0,
                 from /tmp/modconfig-7RaPAH/vmmon-only/vmcore/moduleloop.c:35:
/tmp/modconfig-7RaPAH/vmmon-only/./include/x86msr.h:115:0: warning: "MSR_MISC_FEATURES_ENABLES" redefined
 #define MSR_MISC_FEATURES_ENABLES            0x140
 
In file included from ./arch/x86/include/asm/msr.h:5:0,
                 from ./arch/x86/include/asm/processor.h:21,
                 from ./arch/x86/include/asm/cpufeature.h:5,
                 from ./arch/x86/include/asm/thread_info.h:53,
                 from ./include/linux/thread_info.h:38,
                 from ./arch/x86/include/asm/preempt.h:7,
                 from ./include/linux/preempt.h:81,
                 from ./include/linux/rcupdate.h:40,
                 from ./include/linux/rculist.h:11,
                 from ./include/linux/pid.h:5,
                 from ./include/linux/sched.h:14,
                 from /tmp/modconfig-7RaPAH/vmmon-only/vmcore/moduleloop.c:31:
./arch/x86/include/asm/msr-index.h:572:0: note: this is the location of the previous definition
 #define MSR_MISC_FEATURES_ENABLES 0x00000140
 
/tmp/modconfig-7RaPAH/vmmon-only/bootstrap/monLoaderVmmon.o: warning: objtool: MonLoaderCallout_AllocMPN() falls through to next function MonLoaderCallout_MapMPNInPTE()
/tmp/modconfig-7RaPAH/vmmon-only/bootstrap/monLoaderVmmon.o: warning: objtool: MonLoaderCallout_FillPage() falls through to next function MonLoaderCallout_CopyFromBlob()
/tmp/modconfig-7RaPAH/vmmon-only/bootstrap/monLoaderVmmon.o: warning: objtool: MonLoaderCallout_CopyFromBlob() falls through to next function MonLoaderCallout_GetSharedUserPage()
/tmp/modconfig-7RaPAH/vmmon-only/bootstrap/monLoaderVmmon.o: warning: objtool: MonLoaderCallout_GetSharedHostPage() falls through to next function MonLoaderCallout_IsPrivileged()
/tmp/modconfig-7RaPAH/vmmon-only/bootstrap/monLoaderVmmon.o: warning: objtool: .text: unexpected end of section
make[1]: *** [Makefile:1507: _module_/tmp/modconfig-7RaPAH/vmmon-only] Błąd 2
make[1]: Opuszczenie katalogu '/usr/src/kernels/4.14.3-300.fc27.x86_64'
make: *** [Makefile:110: vmmon.ko] Błąd 2
make: Opuszczenie katalogu '/tmp/modconfig-7RaPAH/vmmon-only'
make: Wejście do katalogu '/tmp/modconfig-7RaPAH/vmnet-only'
Using kernel build system.
/usr/bin/make -C /lib/modules/4.14.3-300.fc27.x86_64/build/include/.. SUBDIRS=$PWD SRCROOT=$PWD/. \
  MODULEBUILDDIR= modules
make[1]: Wejście do katalogu '/usr/src/kernels/4.14.3-300.fc27.x86_64'
  CC [M]  /tmp/modconfig-7RaPAH/vmnet-only/driver.o
  CC [M]  /tmp/modconfig-7RaPAH/vmnet-only/hub.o
  CC [M]  /tmp/modconfig-7RaPAH/vmnet-only/userif.o
  CC [M]  /tmp/modconfig-7RaPAH/vmnet-only/netif.o
In file included from ./include/linux/pci.h:37:0,
                 from /tmp/modconfig-7RaPAH/vmnet-only/compat_netdevice.h:27,
                 from /tmp/modconfig-7RaPAH/vmnet-only/netif.c:43:
./include/linux/pci_ids.h:2261:0: warning: "PCI_VENDOR_ID_VMWARE" redefined
 #define PCI_VENDOR_ID_VMWARE  0x15ad
 
In file included from /tmp/modconfig-7RaPAH/vmnet-only/net.h:38:0,
                 from /tmp/modconfig-7RaPAH/vmnet-only/vnetInt.h:26,
                 from /tmp/modconfig-7RaPAH/vmnet-only/netif.c:42:
/tmp/modconfig-7RaPAH/vmnet-only/vm_device_version.h:56:0: note: this is the location of the previous definition
 #define PCI_VENDOR_ID_VMWARE                    0x15AD
 
In file included from ./include/linux/pci.h:37:0,
                 from /tmp/modconfig-7RaPAH/vmnet-only/compat_netdevice.h:27,
                 from /tmp/modconfig-7RaPAH/vmnet-only/netif.c:43:
./include/linux/pci_ids.h:2262:0: warning: "PCI_DEVICE_ID_VMWARE_VMXNET3" redefined
 #define PCI_DEVICE_ID_VMWARE_VMXNET3 0x07b0
 
In file included from /tmp/modconfig-7RaPAH/vmnet-only/net.h:38:0,
                 from /tmp/modconfig-7RaPAH/vmnet-only/vnetInt.h:26,
                 from /tmp/modconfig-7RaPAH/vmnet-only/netif.c:42:
/tmp/modconfig-7RaPAH/vmnet-only/vm_device_version.h:73:0: note: this is the location of the previous definition
 #define PCI_DEVICE_ID_VMWARE_VMXNET3            0x07B0
 
  CC [M]  /tmp/modconfig-7RaPAH/vmnet-only/bridge.o
  CC [M]  /tmp/modconfig-7RaPAH/vmnet-only/procfs.o
  CC [M]  /tmp/modconfig-7RaPAH/vmnet-only/smac_compat.o
  CC [M]  /tmp/modconfig-7RaPAH/vmnet-only/smac.o
  CC [M]  /tmp/modconfig-7RaPAH/vmnet-only/vnetEvent.o
In file included from /tmp/modconfig-7RaPAH/vmnet-only/net.h:38:0,
                 from /tmp/modconfig-7RaPAH/vmnet-only/vnetInt.h:26,
                 from /tmp/modconfig-7RaPAH/vmnet-only/bridge.c:53:
/tmp/modconfig-7RaPAH/vmnet-only/vm_device_version.h:56:0: warning: "PCI_VENDOR_ID_VMWARE" redefined
 #define PCI_VENDOR_ID_VMWARE                    0x15AD
 
In file included from ./include/linux/pci.h:37:0,
                 from /tmp/modconfig-7RaPAH/vmnet-only/compat_netdevice.h:27,
                 from /tmp/modconfig-7RaPAH/vmnet-only/bridge.c:52:
./include/linux/pci_ids.h:2261:0: note: this is the location of the previous definition
 #define PCI_VENDOR_ID_VMWARE  0x15ad
 
In file included from /tmp/modconfig-7RaPAH/vmnet-only/net.h:38:0,
                 from /tmp/modconfig-7RaPAH/vmnet-only/vnetInt.h:26,
                 from /tmp/modconfig-7RaPAH/vmnet-only/bridge.c:53:
/tmp/modconfig-7RaPAH/vmnet-only/vm_device_version.h:73:0: warning: "PCI_DEVICE_ID_VMWARE_VMXNET3" redefined
 #define PCI_DEVICE_ID_VMWARE_VMXNET3            0x07B0
 
In file included from ./include/linux/pci.h:37:0,
                 from /tmp/modconfig-7RaPAH/vmnet-only/compat_netdevice.h:27,
                 from /tmp/modconfig-7RaPAH/vmnet-only/bridge.c:52:
./include/linux/pci_ids.h:2262:0: note: this is the location of the previous definition
 #define PCI_DEVICE_ID_VMWARE_VMXNET3 0x07b0
 
  CC [M]  /tmp/modconfig-7RaPAH/vmnet-only/vnetUserListener.o
  LD [M]  /tmp/modconfig-7RaPAH/vmnet-only/vmnet.o
  Building modules, stage 2.
  MODPOST 1 modules
  CC      /tmp/modconfig-7RaPAH/vmnet-only/vmnet.mod.o
  LD [M]  /tmp/modconfig-7RaPAH/vmnet-only/vmnet.ko
make[1]: Opuszczenie katalogu '/usr/src/kernels/4.14.3-300.fc27.x86_64'
/usr/bin/make -C $PWD SRCROOT=$PWD/. \
  MODULEBUILDDIR= postbuild
make[1]: Wejście do katalogu '/tmp/modconfig-7RaPAH/vmnet-only'
make[1]: 'postbuild' jest aktualne.
make[1]: Opuszczenie katalogu '/tmp/modconfig-7RaPAH/vmnet-only'
cp -f vmnet.ko ./../vmnet.o
make: Opuszczenie katalogu '/tmp/modconfig-7RaPAH/vmnet-only'
Unable to install all modules.  See log for details.
sudo vmplayer
Zatrzymywanie vmware (przez systemctl):                    [  OK  ]
make: Wejście do katalogu '/tmp/modconfig-pnr90z/vmmon-only'
Using kernel build system.
/bin/make -C /lib/modules/4.14.3-300.fc27.x86_64/build/include/.. SUBDIRS=$PWD SRCROOT=$PWD/. \
  MODULEBUILDDIR= modules
make[1]: Wejście do katalogu '/usr/src/kernels/4.14.3-300.fc27.x86_64'
  CC [M]  /tmp/modconfig-pnr90z/vmmon-only/linux/driverLog.o
  CC [M]  /tmp/modconfig-pnr90z/vmmon-only/linux/driver.o
  CC [M]  /tmp/modconfig-pnr90z/vmmon-only/linux/hostif.o
  CC [M]  /tmp/modconfig-pnr90z/vmmon-only/common/memtrack.o
  CC [M]  /tmp/modconfig-pnr90z/vmmon-only/common/apic.o
  CC [M]  /tmp/modconfig-pnr90z/vmmon-only/common/hashFunc.o
In file included from /tmp/modconfig-pnr90z/vmmon-only/./common/vmx86.h:32:0,
                 from /tmp/modconfig-pnr90z/vmmon-only/linux/driver.h:32,
                 from /tmp/modconfig-pnr90z/vmmon-only/linux/driver.c:47:
/tmp/modconfig-pnr90z/vmmon-only/./include/x86msr.h:115:0: warning: "MSR_MISC_FEATURES_ENABLES" redefined
 #define MSR_MISC_FEATURES_ENABLES            0x140
 
In file included from ./arch/x86/include/asm/msr.h:5:0,
                 from ./arch/x86/include/asm/processor.h:21,
                 from ./arch/x86/include/asm/cpufeature.h:5,
                 from ./arch/x86/include/asm/thread_info.h:53,
                 from ./include/linux/thread_info.h:38,
                 from ./arch/x86/include/asm/preempt.h:7,
                 from ./include/linux/preempt.h:81,
                 from ./include/linux/spinlock.h:51,
                 from ./include/linux/wait.h:9,
                 from ./include/linux/wait_bit.h:8,
                 from ./include/linux/fs.h:6,
                 from ./include/linux/highmem.h:5,
                 from /tmp/modconfig-pnr90z/vmmon-only/linux/driver.c:25:
./arch/x86/include/asm/msr-index.h:572:0: note: this is the location of the previous definition
 #define MSR_MISC_FEATURES_ENABLES 0x00000140
 
In file included from /tmp/modconfig-pnr90z/vmmon-only/./include/vm_asm.h:43:0,
                 from /tmp/modconfig-pnr90z/vmmon-only/linux/hostif.c:60:
/tmp/modconfig-pnr90z/vmmon-only/./include/x86msr.h:115:0: warning: "MSR_MISC_FEATURES_ENABLES" redefined
 #define MSR_MISC_FEATURES_ENABLES            0x140
 
In file included from ./arch/x86/include/asm/msr.h:5:0,
                 from ./arch/x86/include/asm/processor.h:21,
                 from ./arch/x86/include/asm/cpufeature.h:5,
                 from ./arch/x86/include/asm/thread_info.h:53,
                 from ./include/linux/thread_info.h:38,
                 from ./arch/x86/include/asm/preempt.h:7,
                 from ./include/linux/preempt.h:81,
                 from ./include/linux/rcupdate.h:40,
                 from ./include/linux/rculist.h:11,
                 from ./include/linux/pid.h:5,
                 from ./include/linux/sched.h:14,
                 from ./include/linux/binfmts.h:5,
                 from /tmp/modconfig-pnr90z/vmmon-only/linux/hostif.c:32:
./arch/x86/include/asm/msr-index.h:572:0: note: this is the location of the previous definition
 #define MSR_MISC_FEATURES_ENABLES 0x00000140
 
  CC [M]  /tmp/modconfig-pnr90z/vmmon-only/common/vmx86.o
In file included from /tmp/modconfig-pnr90z/vmmon-only/./include/vm_asm_x86.h:41:0,
                 from /tmp/modconfig-pnr90z/vmmon-only/./include/vm_asm_x86_64.h:40,
                 from /tmp/modconfig-pnr90z/vmmon-only/./include/vm_asm.h:46,
                 from /tmp/modconfig-pnr90z/vmmon-only/linux/hostif.c:60:
/tmp/modconfig-pnr90z/vmmon-only/./include/x86_basic_defs.h:78:0: warning: "CR3_PCID_MASK" redefined
 #define CR3_PCID_MASK  0xFFF
 
In file included from ./arch/x86/include/asm/irqflags.h:5:0,
                 from ./include/linux/irqflags.h:16,
                 from ./include/linux/rcupdate.h:39,
                 from ./include/linux/rculist.h:11,
                 from ./include/linux/pid.h:5,
                 from ./include/linux/sched.h:14,
                 from ./include/linux/binfmts.h:5,
                 from /tmp/modconfig-pnr90z/vmmon-only/linux/hostif.c:32:
./arch/x86/include/asm/processor-flags.h:39:0: note: this is the location of the previous definition
 #define CR3_PCID_MASK 0xFFFull
 
In file included from /tmp/modconfig-pnr90z/vmmon-only/./include/vm_asm_x86.h:41:0,
                 from /tmp/modconfig-pnr90z/vmmon-only/./include/vm_asm_x86_64.h:40,
                 from /tmp/modconfig-pnr90z/vmmon-only/./include/vm_asm.h:46,
                 from /tmp/modconfig-pnr90z/vmmon-only/linux/driver.c:49:
/tmp/modconfig-pnr90z/vmmon-only/./include/x86_basic_defs.h:78:0: warning: "CR3_PCID_MASK" redefined
 #define CR3_PCID_MASK  0xFFF
 
In file included from ./arch/x86/include/asm/processor.h:5:0,
                 from ./arch/x86/include/asm/cpufeature.h:5,
                 from ./arch/x86/include/asm/thread_info.h:53,
                 from ./include/linux/thread_info.h:38,
                 from ./arch/x86/include/asm/preempt.h:7,
                 from ./include/linux/preempt.h:81,
                 from ./include/linux/spinlock.h:51,
                 from ./include/linux/wait.h:9,
                 from ./include/linux/wait_bit.h:8,
                 from ./include/linux/fs.h:6,
                 from ./include/linux/highmem.h:5,
                 from /tmp/modconfig-pnr90z/vmmon-only/linux/driver.c:25:
./arch/x86/include/asm/processor-flags.h:39:0: note: this is the location of the previous definition
 #define CR3_PCID_MASK 0xFFFull
 
/tmp/modconfig-pnr90z/vmmon-only/linux/driver.c:981:1: warning: always_inline function might not be inlinable [-Wattributes]
 LinuxDriverSyncReadTSCs(uint64 *delta) // OUT: TSC max - TSC min
 ^~~~~~~~~~~~~~~~~~~~~~~
  CC [M]  /tmp/modconfig-pnr90z/vmmon-only/common/cpuid.o
/tmp/modconfig-pnr90z/vmmon-only/linux/hostif.c: In function ‘HostIF_EstimateLockedPageLimit’:
/tmp/modconfig-pnr90z/vmmon-only/linux/hostif.c:1519:31: error: implicit declaration of function ‘global_page_state’; did you mean ‘global_numa_state’? [-Werror=implicit-function-declaration]
    unsigned int lockedPages = global_page_state(NR_PAGETABLE) +
                               ^~~~~~~~~~~~~~~~~
                               global_numa_state
In file included from /tmp/modconfig-pnr90z/vmmon-only/common/vmx86.h:32:0,
                 from /tmp/modconfig-pnr90z/vmmon-only/common/vmx86.c:43:
/tmp/modconfig-pnr90z/vmmon-only/./include/x86msr.h:115:0: warning: "MSR_MISC_FEATURES_ENABLES" redefined
 #define MSR_MISC_FEATURES_ENABLES            0x140
 
In file included from ./arch/x86/include/asm/msr.h:5:0,
                 from ./arch/x86/include/asm/processor.h:21,
                 from ./arch/x86/include/asm/cpufeature.h:5,
                 from ./arch/x86/include/asm/thread_info.h:53,
                 from ./include/linux/thread_info.h:38,
                 from ./arch/x86/include/asm/preempt.h:7,
                 from ./include/linux/preempt.h:81,
                 from ./include/linux/rcupdate.h:40,
                 from ./include/linux/rculist.h:11,
                 from ./include/linux/pid.h:5,
                 from ./include/linux/sched.h:14,
                 from /tmp/modconfig-pnr90z/vmmon-only/common/vmx86.c:31:
./arch/x86/include/asm/msr-index.h:572:0: note: this is the location of the previous definition
 #define MSR_MISC_FEATURES_ENABLES 0x00000140
 
In file included from /tmp/modconfig-pnr90z/vmmon-only/./include/vm_asm_x86.h:41:0,
                 from /tmp/modconfig-pnr90z/vmmon-only/./include/vm_asm_x86_64.h:40,
                 from /tmp/modconfig-pnr90z/vmmon-only/./include/vm_asm.h:46,
                 from /tmp/modconfig-pnr90z/vmmon-only/common/vmx86.c:46:
/tmp/modconfig-pnr90z/vmmon-only/./include/x86_basic_defs.h:78:0: warning: "CR3_PCID_MASK" redefined
 #define CR3_PCID_MASK  0xFFF
 
In file included from ./arch/x86/include/asm/irqflags.h:5:0,
                 from ./include/linux/irqflags.h:16,
                 from ./include/linux/rcupdate.h:39,
                 from ./include/linux/rculist.h:11,
                 from ./include/linux/pid.h:5,
                 from ./include/linux/sched.h:14,
                 from /tmp/modconfig-pnr90z/vmmon-only/common/vmx86.c:31:
./arch/x86/include/asm/processor-flags.h:39:0: note: this is the location of the previous definition
 #define CR3_PCID_MASK 0xFFFull
 
  CC [M]  /tmp/modconfig-pnr90z/vmmon-only/common/task.o
  CC [M]  /tmp/modconfig-pnr90z/vmmon-only/common/comport.o
In file included from ./arch/x86/include/asm/processor.h:5:0,
                 from ./arch/x86/include/asm/cpufeature.h:5,
                 from ./arch/x86/include/asm/thread_info.h:53,
                 from ./include/linux/thread_info.h:38,
                 from ./arch/x86/include/asm/preempt.h:7,
                 from ./include/linux/preempt.h:81,
                 from ./include/linux/spinlock.h:51,
                 from ./arch/x86/include/asm/mmu.h:5,
                 from ./arch/x86/include/asm/desc.h:7,
                 from /tmp/modconfig-pnr90z/vmmon-only/common/task.c:70:
./arch/x86/include/asm/processor-flags.h:39:0: warning: "CR3_PCID_MASK" redefined
 #define CR3_PCID_MASK 0xFFFull
 
In file included from /tmp/modconfig-pnr90z/vmmon-only/./include/vm_asm_x86.h:41:0,
                 from /tmp/modconfig-pnr90z/vmmon-only/./include/vm_asm_x86_64.h:40,
                 from /tmp/modconfig-pnr90z/vmmon-only/./include/vm_asm.h:46,
                 from /tmp/modconfig-pnr90z/vmmon-only/common/task.c:53:
/tmp/modconfig-pnr90z/vmmon-only/./include/x86_basic_defs.h:78:0: note: this is the location of the previous definition
 #define CR3_PCID_MASK  0xFFF
 
In file included from ./arch/x86/include/asm/msr.h:5:0,
                 from ./arch/x86/include/asm/processor.h:21,
                 from ./arch/x86/include/asm/cpufeature.h:5,
                 from ./arch/x86/include/asm/thread_info.h:53,
                 from ./include/linux/thread_info.h:38,
                 from ./arch/x86/include/asm/preempt.h:7,
                 from ./include/linux/preempt.h:81,
                 from ./include/linux/spinlock.h:51,
                 from ./arch/x86/include/asm/mmu.h:5,
                 from ./arch/x86/include/asm/desc.h:7,
                 from /tmp/modconfig-pnr90z/vmmon-only/common/task.c:70:
./arch/x86/include/asm/msr-index.h:572:0: warning: "MSR_MISC_FEATURES_ENABLES" redefined
 #define MSR_MISC_FEATURES_ENABLES 0x00000140
 
In file included from /tmp/modconfig-pnr90z/vmmon-only/common/vmx86.h:32:0,
                 from /tmp/modconfig-pnr90z/vmmon-only/common/task.c:51:
/tmp/modconfig-pnr90z/vmmon-only/./include/x86msr.h:115:0: note: this is the location of the previous definition
 #define MSR_MISC_FEATURES_ENABLES            0x140
 
  CC [M]  /tmp/modconfig-pnr90z/vmmon-only/common/phystrack.o
/tmp/modconfig-pnr90z/vmmon-only/common/phystrack.o: warning: objtool: PhysTrack_Free() falls through to next function PhysTrack_Add()
/tmp/modconfig-pnr90z/vmmon-only/common/phystrack.o: warning: objtool: PhysTrack_Add() falls through to next function PhysTrack_Remove()
/tmp/modconfig-pnr90z/vmmon-only/common/phystrack.o: warning: objtool: PhysTrack_Remove() falls through to next function PhysTrack_Test()
  CC [M]  /tmp/modconfig-pnr90z/vmmon-only/vmcore/moduleloop.o
cc1: some warnings being treated as errors
make[2]: *** [scripts/Makefile.build:315: /tmp/modconfig-pnr90z/vmmon-only/linux/hostif.o] Błąd 1
make[2]: *** Oczekiwanie na niezakończone zadania....
/tmp/modconfig-pnr90z/vmmon-only/common/vmx86.o: warning: objtool: Vmx86EnableHVOnCPU() falls through to next function Vmx86GetMSR()
In file included from /tmp/modconfig-pnr90z/vmmon-only/./common/vmx86.h:32:0,
                 from /tmp/modconfig-pnr90z/vmmon-only/vmcore/moduleloop.c:35:
/tmp/modconfig-pnr90z/vmmon-only/./include/x86msr.h:115:0: warning: "MSR_MISC_FEATURES_ENABLES" redefined
 #define MSR_MISC_FEATURES_ENABLES            0x140
 
In file included from ./arch/x86/include/asm/msr.h:5:0,
                 from ./arch/x86/include/asm/processor.h:21,
                 from ./arch/x86/include/asm/cpufeature.h:5,
                 from ./arch/x86/include/asm/thread_info.h:53,
                 from ./include/linux/thread_info.h:38,
                 from ./arch/x86/include/asm/preempt.h:7,
                 from ./include/linux/preempt.h:81,
                 from ./include/linux/rcupdate.h:40,
                 from ./include/linux/rculist.h:11,
                 from ./include/linux/pid.h:5,
                 from ./include/linux/sched.h:14,
                 from /tmp/modconfig-pnr90z/vmmon-only/vmcore/moduleloop.c:31:
./arch/x86/include/asm/msr-index.h:572:0: note: this is the location of the previous definition
 #define MSR_MISC_FEATURES_ENABLES 0x00000140
 
/tmp/modconfig-pnr90z/vmmon-only/common/task.o: warning: objtool: .text: unexpected end of section
make[1]: *** [Makefile:1507: _module_/tmp/modconfig-pnr90z/vmmon-only] Błąd 2
make[1]: Opuszczenie katalogu '/usr/src/kernels/4.14.3-300.fc27.x86_64'
make: *** [Makefile:110: vmmon.ko] Błąd 2
make: Opuszczenie katalogu '/tmp/modconfig-pnr90z/vmmon-only'
Uruchamianie vmware (przez systemctl):  Job for vmware.service failed because the control process exited with error code.
See "systemctl  status vmware.service" and "journalctl  -xe" for details.
                                                           [NIEUDANE]

 

Udostępnij tego posta


Odnośnik do posta
Udostępnij na innych stronach

Nie wiem nie znam się ale może coś da :) ale problem jest vhyba bardziej złożony z tego co czytam na zagranicznych forach. 

 

dnf install kernel-headers-`uname -r`

 

Udostępnij tego posta


Odnośnik do posta
Udostępnij na innych stronach
21 minut temu, DEMON napisał:

Nie wiem nie znam się ale może coś da :) ale problem jest vhyba bardziej złożony z tego co czytam na zagranicznych forach. 

 


dnf install kernel-headers-`uname -r`

 

Niestety wszystko już miałem

sudo dnf install kernel-headers-`uname -r`
Ostatnio sprawdzono ważność metadanych: 2:20:32 temu w dniu czw, 14 gru 2017, 17:15:22.
Pakiet kernel-headers-4.14.3-300.fc27.x86_64 jest już zainstalowany, pomijanie.
Rozwiązano zależności.
Nie ma nic do zrobienia.
Ukończono.
[alastis@localhost ~]$ 

 

Udostępnij tego posta


Odnośnik do posta
Udostępnij na innych stronach

Sprawdź czy masz też pakiet kernel-devel. Ja muszę mieć ten pakiet do kompilacji sterowników VirtualBox, więc być może Vmware Player też tak ma.

Udostępnij tego posta


Odnośnik do posta
Udostępnij na innych stronach
1 godzinę temu, WalDo napisał:

Sprawdź czy masz też pakiet kernel-devel. Ja muszę mieć ten pakiet do kompilacji sterowników VirtualBox, więc być może Vmware Player też tak ma.

Wszystko jest:

[alastis@localhost ~]$ sudo dnf install kernel-devel
Ostatnio sprawdzono ważność metadanych: 0:59:56 temu w dniu czw, 14 gru 2017, 20:18:26.
Pakiet kernel-devel-4.13.16-302.fc27.x86_64 jest już zainstalowany, pomijanie.
Pakiet kernel-devel-4.14.3-300.fc27.x86_64 jest już zainstalowany, pomijanie.
Rozwiązano zależności.
Nie ma nic do zrobienia.
Ukończono.
[alastis@localhost ~]$ 

VirtualBox i Qemu działają niestety Vmware Player ma problem sprawdzałem na innych forach taki problem ale dotyczy on zwykle Ubuntu i innego kernela wiec nie wiem czy próbować.

 

Przyczyną problemu jest kernel 4.14 na 4.13 uruchomił się

Udostępnij tego posta


Odnośnik do posta
Udostępnij na innych stronach

No jeśli masz 4.14 to kernel--devel 4.13 nie pomoże. Musisz mieć 4.14. Dziwne. Na jakim kernelu jesteś jak instalujesz/aktualizujesz kernel-devel?

Udostępnij tego posta


Odnośnik do posta
Udostępnij na innych stronach
4 minuty temu, WalDo napisał:

No jeśli masz 4.14 to kernel--devel 4.13 nie pomoże. Musisz mieć 4.14. Dziwne. Na jakim kernelu jesteś jak instalujesz/aktualizujesz kernel-devel?

Teraz dopiero zauważyłem miałem 4.13.16-302.fc27.x86_64 i system mi się zaktualizował do 4.14 korzystam na co dzień z 4.14 ale teraz widz systemie śmietnik.

Instaluje nowe a stare zostawia nieużywane.

Może vmware po prostu nie wie z którego korzystać chociaż to bez sensu...

Udostępnij tego posta


Odnośnik do posta
Udostępnij na innych stronach
2 godziny temu, alastis napisał:

Teraz dopiero zauważyłem miałem 4.13.16-302.fc27.x86_64 i system mi się zaktualizował do 4.14 korzystam na co dzień z 4.14 ale teraz widz systemie śmietnik.

Instaluje nowe a stare zostawia nieużywane.

Może vmware po prostu nie wie z którego korzystać chociaż to bez sensu...

Wywaliłem wszystko, zostawiłem 4.14 z kernel headers i kernel devel ale niestety nie rusza

[alastis@localhost ~]$ sudo dnf install kernel-headers-`uname -r`
Ostatnio sprawdzono ważność metadanych: 1:32:48 temu w dniu czw, 14 gru 2017, 23:24:04.
Pakiet kernel-headers-4.14.3-300.fc27.x86_64 jest już zainstalowany, pomijanie.
Rozwiązano zależności.
Nie ma nic do zrobienia.
Ukończono.
[alastis@localhost ~]$ sudo dnf install kernel-devel
Ostatnio sprawdzono ważność metadanych: 1:32:59 temu w dniu czw, 14 gru 2017, 23:24:04.
Pakiet kernel-devel-4.14.3-300.fc27.x86_64 jest już zainstalowany, pomijanie.
Rozwiązano zależności.
Nie ma nic do zrobienia.
Ukończono.
[alastis@localhost ~]$ uname -r
4.14.3-300.fc27.x86_64
[alastis@localhost ~]$ 

Udostępnij tego posta


Odnośnik do posta
Udostępnij na innych stronach

Problem rozwiązany, przyczyną jest kernel 4.14, który nie jest jeszcze wspierany przez Vmvare na 4.13 wszystko działa

Udostępnij tego posta


Odnośnik do posta
Udostępnij na innych stronach

Jeśli chcesz dodać odpowiedź, zaloguj się lub zarejestruj nowe konto

Jedynie zarejestrowani użytkownicy mogą komentować zawartość tej strony.

Zarejestruj nowe konto

Załóż nowe konto. To bardzo proste!

Zarejestruj się

Zaloguj się

Posiadasz już konto? Zaloguj się poniżej.

Zaloguj się

×