ciebanna Napisano Marzec 21, 2008 Autor Zgłoszenie Share Napisano Marzec 21, 2008 Więc dokładnie to jest tak: [root@localhost ~]# cd ./RT73_Linux_STA_Drv1.0.4.0/Module [root@localhost Module]# cp Makefile.6 ./Makefile cp: zamazać `./Makefile'? Tu daję enter i powracam do: [root@localhost Module] więc dalej piszę mu: make all a mój linuksik do mnie tak: rtmp.h:2829: error: expected declaration specifiers or ?...? before ?u16? rtmp.h:2833: error: expected declaration specifiers or ?...? before ?u8? rtmp.h:2834: error: expected declaration specifiers or ?...? before ?PUCHAR? rtmp.h:2838: error: expected declaration specifiers or ?...? before ?u8? rtmp.h:2839: error: expected declaration specifiers or ?...? before ?u8? rtmp.h:2843: error: expected declaration specifiers or ?...? before ?u32? rtmp.h:2847: error: expected declaration specifiers or ?...? before ?u16? rtmp.h:2848: error: expected declaration specifiers or ?...? before ?PUCHAR? rtmp.h:2849: error: expected declaration specifiers or ?...? before ?u16? rtmp.h:2853: error: expected declaration specifiers or ?...? before ?u16? rtmp.h:2854: error: expected declaration specifiers or ?...? before ?PUCHAR? rtmp.h:2855: error: expected declaration specifiers or ?...? before ?u16? rtmp.h:2868: error: expected declaration specifiers or ?...? before ?u32? rtmp.h:2869: error: expected declaration specifiers or ?...? before ?u8? rtmp.h:2871: error: expected declaration specifiers or ?...? before ?u32? rtmp.h:2875: error: expected declaration specifiers or ?...? before ?u32? rtmp.h:2883: error: expected declaration specifiers or ?...? before ?u32? rtmp.h:2884: error: expected declaration specifiers or ?...? before ?u8? rtmp.h:2885: error: expected declaration specifiers or ?...? before ?u8? rtmp.h:2886: error: expected declaration specifiers or ?...? before ?u16? rtmp.h:2887: error: expected declaration specifiers or ?...? before ?u16? rtmp.h:2889: error: expected declaration specifiers or ?...? before ?u32? rtmp.h:2908: error: expected declaration specifiers or ?...? before ?u8? rtmp.h:2909: error: expected declaration specifiers or ?...? before ?PUCHAR? rtmp.h:2910: error: expected declaration specifiers or ?...? before ?PUCHAR? rtmp.h:2910: warning: ?struct sk_buff? declared inside parameter list rtmp.h:2914: warning: ?struct sk_buff? declared inside parameter list rtmp.h:2918: warning: ?struct sk_buff? declared inside parameter list rtmp.h:2926: error: expected declaration specifiers or ?...? before ?u8? rtmp.h:2927: error: expected declaration specifiers or ?...? before ?u8? rtmp.h:2927: warning: ?struct sk_buff? declared inside parameter list rtmp.h:2935: error: expected declaration specifiers or ?...? before ?u8? rtmp.h:2936: error: expected declaration specifiers or ?...? before ?u8? rtmp.h:2937: error: expected declaration specifiers or ?...? before ?u8? rtmp.h:2945: error: expected declaration specifiers or ?...? before ?u8? rtmp.h:2946: error: expected declaration specifiers or ?...? before ?u8? rtmp.h:2947: error: expected declaration specifiers or ?...? before ?u8? rtmp.h:2948: error: expected declaration specifiers or ?...? before ?u8? rtmp.h:2949: error: expected declaration specifiers or ?...? before ?u8? rtmp.h:2950: error: expected declaration specifiers or ?...? before ?u8? rtmp.h:2951: error: expected declaration specifiers or ?...? before ?u8? rtmp.h:2952: error: expected declaration specifiers or ?...? before ?u8? rtmp.h:2953: error: expected declaration specifiers or ?...? before ?u32? rtmp.h:2954: error: expected declaration specifiers or ?...? before ?u32? rtmp.h:2955: error: expected declaration specifiers or ?...? before ?u8? rtmp.h:2956: error: expected declaration specifiers or ?...? before ?u8? rtmp.h:2957: error: expected declaration specifiers or ?...? before ?u8? rtmp.h:2961: error: expected declaration specifiers or ?...? before ?u8? rtmp.h:2981: error: expected declaration specifiers or ?...? before ?u32? rtmp.h:2983: error: expected ?=?, ?,?, ?;?, ?asm? or ?__attribute__? before ?RTMPSearchTupleCache? rtmp.h:3007: error: expected declaration specifiers or ?...? before ?u8? rtmp.h:3011: error: expected declaration specifiers or ?...? before ?PUCHAR? rtmp.h:3012: error: expected declaration specifiers or ?...? before ?u32? rtmp.h:3013: error: expected declaration specifiers or ?...? before ?u8? rtmp.h:3014: error: expected declaration specifiers or ?...? before ?u8? rtmp.h:3015: error: expected declaration specifiers or ?...? before ?u16? rtmp.h:3016: error: expected declaration specifiers or ?...? before ?u8? rtmp.h:3017: error: expected declaration specifiers or ?...? before ?u8? rtmp.h:3018: error: expected declaration specifiers or ?...? before ?u8? rtmp.h:3020: error: expected ?=?, ?,?, ?;?, ?asm? or ?__attribute__? before ?RTMPCalcDuration? rtmp.h:3025: error: expected ?=?, ?,?, ?;?, ?asm? or ?__attribute__? before ?RTMPCheckDHCPFrame? rtmp.h:3035: error: expected declaration specifiers or ?...? before ?PUCHAR? rtmp.h:3036: error: expected declaration specifiers or ?...? before ?u8? rtmp.h:3037: error: expected declaration specifiers or ?...? before ?u8? rtmp.h:3038: error: expected declaration specifiers or ?...? before ?PUCHAR? rtmp.h:3042: error: expected declaration specifiers or ?...? before ?PUCHAR? rtmp.h:3043: error: expected declaration specifiers or ?...? before ?PUCHAR? rtmp.h:3044: error: expected declaration specifiers or ?...? before ?u32? rtmp.h:3048: error: expected declaration specifiers or ?...? before ?PUCHAR? rtmp.h:3049: error: expected declaration specifiers or ?...? before ?u32? rtmp.h:3051: error: expected ?=?, ?,?, ?;?, ?asm? or ?__attribute__? before ?ARCFOUR_BYTE? rtmp.h:3056: error: expected declaration specifiers or ?...? before ?PUCHAR? rtmp.h:3057: error: expected declaration specifiers or ?...? before ?PUCHAR? rtmp.h:3058: error: expected declaration specifiers or ?...? before ?u32? rtmp.h:3062: error: expected declaration specifiers or ?...? before ?PUCHAR? rtmp.h:3063: error: expected declaration specifiers or ?...? before ?PUCHAR? rtmp.h:3064: error: expected declaration specifiers or ?...? before ?u32? rtmp.h:3066: error: expected ?=?, ?,?, ?;?, ?asm? or ?__attribute__? before ?RTMP_CALC_FCS32? rtmp.h:3073: error: expected declaration specifiers or ?...? before ?PUCHAR? rtmp.h:3080: error: expected declaration specifiers or ?...? before ?PUCHAR? rtmp.h:3081: error: expected declaration specifiers or ?...? before ?u8? rtmp.h:3082: error: expected declaration specifiers or ?...? before ?PUCHAR? rtmp.h:3083: error: expected declaration specifiers or ?...? before ?PUCHAR? rtmp.h:3084: error: expected declaration specifiers or ?...? before ?PUCHAR? rtmp.h:3085: error: expected declaration specifiers or ?...? before ?PULONG? rtmp.h:3086: error: expected declaration specifiers or ?...? before ?PULONG? rtmp.h:3090: error: expected declaration specifiers or ?...? before ?PUCHAR? rtmp.h:3091: error: expected declaration specifiers or ?...? before ?PUCHAR? rtmp.h:3092: error: expected declaration specifiers or ?...? before ?PUCHAR? rtmp.h:3093: error: expected declaration specifiers or ?...? before ?u8? rtmp.h:3094: error: expected declaration specifiers or ?...? before ?PUCHAR? rtmp.h:3096: error: expected ?=?, ?,?, ?;?, ?asm? or ?__attribute__? before ?RTMPTkipCompareMICValue? rtmp.h:3107: error: expected declaration specifiers or ?...? before ?PUCHAR? rtmp.h:3108: warning: ?struct sk_buff? declared inside parameter list rtmp.h:3110: error: expected ?=?, ?,?, ?;?, ?asm? or ?__attribute__? before ?RTMPTkipCompareMICValueWithLLC? rtmp.h:3121: error: expected declaration specifiers or ?...? before ?PUCHAR? rtmp.h:3122: error: expected declaration specifiers or ?...? before ?u32? rtmp.h:3130: error: expected ?=?, ?,?, ?;?, ?asm? or ?__attribute__? before ?WpaMsgTypeSubst? rtmp.h:3158: error: expected declaration specifiers or ?...? before ?u8? rtmp.h:3159: error: expected declaration specifiers or ?...? before ?PUCHAR? rtmp.h:3171: error: expected declaration specifiers or ?...? before ?PUCHAR? rtmp.h:3172: error: expected declaration specifiers or ?...? before ?u8? rtmp.h:3173: error: expected declaration specifiers or ?...? before ?u8? rtmp.h:3174: error: expected declaration specifiers or ?...? before ?u8? rtmp.h:3183: error: expected declaration specifiers or ?...? before ?PUCHAR? rtmp.h:3184: error: expected declaration specifiers or ?...? before ?u32? rtmp.h:3187: error: expected ?)? before ?*? token rtmp.h:3194: error: expected ?)? before ?*? token rtmp.h:3204: error: expected ?)? before ?*? token rtmp.h:3214: error: expected declaration specifiers or ?...? before ?u8? rtmp.h:3217: error: expected ?)? before ?*? token rtmp.h:3225: error: expected declaration specifiers or ?...? before ?PUCHAR? rtmp.h:3226: error: expected declaration specifiers or ?...? before ?u32? rtmp.h:3227: error: expected declaration specifiers or ?...? before ?u32? rtmp.h:3264: error: expected declaration specifiers or ?...? before ?u32? rtmp.h:3272: error: expected declaration specifiers or ?...? before ?PUCHAR? rtmp.h:3276: error: expected declaration specifiers or ?...? before ?PUCHAR? rtmp.h:3280: error: expected declaration specifiers or ?...? before ?PUCHAR? rtmp.h:3284: error: expected declaration specifiers or ?...? before ?PUCHAR? rtmp.h:3288: error: expected declaration specifiers or ?...? before ?PUCHAR? rtmp.h:3292: error: expected declaration specifiers or ?...? before ?PUCHAR? rtmp.h:3296: error: expected declaration specifiers or ?...? before ?PUCHAR? rtmp.h:3300: error: expected declaration specifiers or ?...? before ?PUCHAR? rtmp.h:3310: error: expected declaration specifiers or ?...? before ?PUCHAR? rtmp.h:3314: error: expected declaration specifiers or ?...? before ?PUCHAR? rtmp.h:3318: error: expected declaration specifiers or ?...? before ?PUCHAR? rtmp.h:3322: error: expected declaration specifiers or ?...? before ?PUCHAR? rtmp.h:3326: error: expected declaration specifiers or ?...? before ?PUCHAR? rtmp.h:3336: error: expected declaration specifiers or ?...? before ?PUCHAR? rtmp.h:3346: error: expected declaration specifiers or ?...? before ?PUCHAR? rtmp.h:3350: error: expected declaration specifiers or ?...? before ?PUCHAR? rtmp.h:3354: error: expected declaration specifiers or ?...? before ?PUCHAR? rtmp.h:3358: error: expected declaration specifiers or ?...? before ?PUCHAR? rtmp.h:3362: error: expected declaration specifiers or ?...? before ?PUCHAR? rtmp.h:3366: error: expected declaration specifiers or ?...? before ?PUCHAR? rtmp.h:3370: error: expected declaration specifiers or ?...? before ?PUCHAR? rtmp.h:3374: error: expected declaration specifiers or ?...? before ?PUCHAR? rtmp.h:3378: error: expected declaration specifiers or ?...? before ?PUCHAR? rtmp.h:3382: error: expected declaration specifiers or ?...? before ?PUCHAR? rtmp.h:3386: error: expected declaration specifiers or ?...? before ?PUCHAR? rtmp.h:3390: error: expected declaration specifiers or ?...? before ?PUCHAR? rtmp.h:3394: error: expected declaration specifiers or ?...? before ?PUCHAR? rtmp.h:3423: error: expected declaration specifiers or ?...? before ?u8? rtmp.h:3518: error: expected ?)? before ?pData? rtmp.h:3544: error: expected ?)? before ?Dest? rtmp.h:3562: error: expected declaration specifiers or ?...? before ?PUCHAR? rtmp.h:3563: error: expected declaration specifiers or ?...? before ?u32? rtmp.h:3564: error: expected declaration specifiers or ?...? before ?u8? rtmp.h: In function ?RTMPFrameEndianChange?: rtmp.h:3567: error: ?PUCHAR? undeclared (first use in this function) rtmp.h:3567: error: (Each undeclared identifier is reported only once rtmp.h:3567: error: for each function it appears in.) rtmp.h:3567: error: expected ?;? before ?pMacHdr? rtmp.h:3570: error: ?Dir? undeclared (first use in this function) rtmp.h:3572: error: ?u16? undeclared (first use in this function) rtmp.h:3572: error: expected expression before ?)? token rtmp.h:3575: error: ?pData? undeclared (first use in this function) rtmp.h:3576: error: ?pMacHdr? undeclared (first use in this function) rtmp.h:3576: error: expected ?;? before ?pFrame? rtmp.h:3579: error: expected expression before ?)? token rtmp.h:3579: error: expected expression before ?)? token rtmp.h:3579: error: expected expression before ?)? token rtmp.h:3582: error: expected expression before ?)? token rtmp.h:3582: error: expected expression before ?)? token rtmp.h:3582: error: expected expression before ?)? token rtmp.h:3584: error: ?FRAME_CONTROL? has no member named ?Type? rtmp.h:3586: error: ?FRAME_CONTROL? has no member named ?SubType? rtmp.h:3592: error: expected expression before ?)? token rtmp.h:3596: error: expected expression before ?)? token rtmp.h:3603: error: expected expression before ?)? token rtmp.h:3607: error: expected expression before ?)? token rtmp.h:3611: error: expected expression before ?)? token rtmp.h:3617: error: ?FromRxDoneInt? undeclared (first use in this function) rtmp.h:3617: error: ?FRAME_CONTROL? has no member named ?Wep? rtmp.h:3621: error: expected expression before ?)? token rtmp.h:3625: error: expected expression before ?)? token rtmp.h:3629: error: expected expression before ?)? token rtmp.h:3637: error: expected expression before ?)? token rtmp.h:3641: error: expected expression before ?)? token rtmp.h:3648: error: expected expression before ?)? token rtmp.h:3652: error: ?FRAME_CONTROL? has no member named ?Type? rtmp.h:3655: error: ?FRAME_CONTROL? has no member named ?Type? rtmp.h:3666: error: expected expression before ?)? token rtmp.h: At top level: rtmp.h:3670: error: expected ?=?, ?,?, ?;?, ?asm? or ?__attribute__? before ?RTMPEqualMemory? rtmp.h:3705: error: expected ?=?, ?,?, ?;?, ?asm? or ?__attribute__? before ?BackDoorProbeRspSanity? rtmp_main.c:42: error: expected ?=?, ?,?, ?;?, ?asm? or ?__attribute__? before ?RTDebugLevel? rtmp_main.c:48: error: expected declaration specifiers or ?...? before string constant rtmp_main.c:48: warning: data definition has no type or storage class rtmp_main.c:48: warning: type defaults to ?int? in declaration of ?MODULE_AUTHOR? rtmp_main.c:48: warning: function declaration isn?t a prototype rtmp_main.c:49: error: expected declaration specifiers or ?...? before string constant rtmp_main.c:49: warning: data definition has no type or storage class rtmp_main.c:49: warning: type defaults to ?int? in declaration of ?MODULE_DESCRIPTION? rtmp_main.c:49: warning: function declaration isn?t a prototype rtmp_main.c:52: error: expected declaration specifiers or ?...? before string constant rtmp_main.c:52: warning: data definition has no type or storage class rtmp_main.c:52: warning: type defaults to ?int? in declaration of ?MODULE_LICENSE? rtmp_main.c:52: warning: function declaration isn?t a prototype rtmp_main.c:66: error: array type has incomplete element type rtmp_main.c:66: warning: implicit declaration of function ?USB_DEVICE? rtmp_main.c:67: error: invalid application of ?sizeof? to incomplete type ?struct usb_device_id? rtmp_main.c:68: warning: data definition has no type or storage class rtmp_main.c:68: warning: type defaults to ?int? in declaration of ?MODULE_DEVICE_TABLE? rtmp_main.c:68: warning: parameter names (without types) in function declaration rtmp_main.c:101: warning: ?struct usb_interface? declared inside parameter list rtmp_main.c:103: warning: ?struct usb_interface? declared inside parameter list rtmp_main.c:105: error: variable ?rtusb_driver? has initializer but incomplete type rtmp_main.c:109: error: unknown field ?name? specified in initializer rtmp_main.c:109: warning: excess elements in struct initializer rtmp_main.c:109: warning: (near initialization for ?rtusb_driver?) rtmp_main.c:110: error: unknown field ?probe? specified in initializer rtmp_main.c:110: warning: excess elements in struct initializer rtmp_main.c:110: warning: (near initialization for ?rtusb_driver?) rtmp_main.c:111: error: unknown field ?disconnect? specified in initializer rtmp_main.c:111: warning: excess elements in struct initializer rtmp_main.c:111: warning: (near initialization for ?rtusb_driver?) rtmp_main.c:112: error: unknown field ?id_table? specified in initializer rtmp_main.c:112: warning: excess elements in struct initializer rtmp_main.c:112: warning: (near initialization for ?rtusb_driver?) rtmp_main.c: In function ?rt73_get_ether_stats?: rtmp_main.c:122: error: dereferencing pointer to incomplete type rtmp_main.c:126: error: ?struct _RTMP_ADAPTER? has no member named ?stats? rtmp_main.c:126: error: ?struct _RTMP_ADAPTER? has no member named ?WlanCounters? rtmp_main.c:127: error: ?struct _RTMP_ADAPTER? has no member named ?stats? rtmp_main.c:127: error: ?struct _RTMP_ADAPTER? has no member named ?WlanCounters? rtmp_main.c:129: error: ?struct _RTMP_ADAPTER? has no member named ?stats? rtmp_main.c:129: error: ?struct _RTMP_ADAPTER? has no member named ?RalinkCounters? rtmp_main.c:130: error: ?struct _RTMP_ADAPTER? has no member named ?stats? rtmp_main.c:130: error: ?struct _RTMP_ADAPTER? has no member named ?RalinkCounters? rtmp_main.c:132: error: ?struct _RTMP_ADAPTER? has no member named ?stats? rtmp_main.c:132: error: ?struct _RTMP_ADAPTER? has no member named ?Counters8023? rtmp_main.c:133: error: ?struct _RTMP_ADAPTER? has no member named ?stats? rtmp_main.c:133: error: ?struct _RTMP_ADAPTER? has no member named ?Counters8023? rtmp_main.c:135: error: ?struct _RTMP_ADAPTER? has no member named ?stats? rtmp_main.c:135: error: ?struct _RTMP_ADAPTER? has no member named ?Counters8023? rtmp_main.c:136: error: ?struct _RTMP_ADAPTER? has no member named ?stats? rtmp_main.c:136: error: ?struct _RTMP_ADAPTER? has no member named ?WlanCounters? rtmp_main.c:138: error: ?struct _RTMP_ADAPTER? has no member named ?stats? rtmp_main.c:138: error: ?struct _RTMP_ADAPTER? has no member named ?WlanCounters? rtmp_main.c:139: error: ?struct _RTMP_ADAPTER? has no member named ?stats? rtmp_main.c:139: error: ?struct _RTMP_ADAPTER? has no member named ?Counters8023? rtmp_main.c:139: error: ?struct _RTMP_ADAPTER? has no member named ?Counters8023? rtmp_main.c:141: error: ?struct _RTMP_ADAPTER? has no member named ?stats? rtmp_main.c:142: error: ?struct _RTMP_ADAPTER? has no member named ?stats? rtmp_main.c:142: error: ?struct _RTMP_ADAPTER? has no member named ?Counters8023? rtmp_main.c:143: error: ?struct _RTMP_ADAPTER? has no member named ?stats? rtmp_main.c:144: error: ?struct _RTMP_ADAPTER? has no member named ?stats? rtmp_main.c:144: error: ?struct _RTMP_ADAPTER? has no member named ?Counters8023? rtmp_main.c:145: error: ?struct _RTMP_ADAPTER? has no member named ?stats? rtmp_main.c:145: error: ?struct _RTMP_ADAPTER? has no member named ?Counters8023? rtmp_main.c:146: error: ?struct _RTMP_ADAPTER? has no member named ?stats? rtmp_main.c:149: error: ?struct _RTMP_ADAPTER? has no member named ?stats? rtmp_main.c:150: error: ?struct _RTMP_ADAPTER? has no member named ?stats? rtmp_main.c:151: error: ?struct _RTMP_ADAPTER? has no member named ?stats? rtmp_main.c:152: error: ?struct _RTMP_ADAPTER? has no member named ?stats? rtmp_main.c:153: error: ?struct _RTMP_ADAPTER? has no member named ?stats? rtmp_main.c:156: error: ?struct _RTMP_ADAPTER? has no member named ?stats? rtmp_main.c:157: error: ?struct _RTMP_ADAPTER? has no member named ?stats? rtmp_main.c:159: error: ?struct _RTMP_ADAPTER? has no member named ?stats? rtmp_main.c: At top level: rtmp_main.c:214: error: expected declaration specifiers or ?...? before ?u8? rtmp_main.c: In function ?RTUSBHalt?: rtmp_main.c:226: error: ?struct _RTMP_ADAPTER? has no member named ?Flags? rtmp_main.c:228: error: ?struct _RTMP_ADAPTER? has no member named ?PortCfg? rtmp_main.c:230: error: ?MLME_DISASSOC_REQ_STRUCT? has no member named ?Addr? rtmp_main.c:230: error: ?struct _RTMP_ADAPTER? has no member named ?PortCfg? rtmp_main.c:231: error: ?MLME_DISASSOC_REQ_STRUCT? has no member named ?Reason? rtmp_main.c:233: error: ?MLME_QUEUE_ELEM? has no member named ?Machine? rtmp_main.c:234: error: ?MLME_QUEUE_ELEM? has no member named ?MsgType? rtmp_main.c:235: error: ?MLME_QUEUE_ELEM? has no member named ?MsgLen? rtmp_main.c:236: error: ?MLME_QUEUE_ELEM? has no member named ?Msg? rtmp_main.c:236: error: too many arguments to function ?RTMPMoveMemory? rtmp_main.c:239: warning: implicit declaration of function ?RTMPusecDelay? rtmp_main.c:245: error: too many arguments to function ?RTUSBWriteMACRegister? rtmp_main.c:248: error: too many arguments to function ?RTMPSendNullFrame? rtmp_main.c:254: error: too many arguments to function ?RTMPSetLED? rtmp_main.c:258: error: ?struct _RTMP_ADAPTER? has no member named ?Flags? rtmp_main.c:263: error: ?struct _RTMP_ADAPTER? has no member named ?PortCfg? rtmp_main.c:264: error: ?struct _RTMP_ADAPTER? has no member named ?RxAnt? rtmp_main.c:279: error: ?IsFree? undeclared (first use in this function) rtmp_main.c:279: error: too many arguments to function ?ReleaseAdapter? rtmp_main.c:281: error: ?struct _RTMP_ADAPTER? has no member named ?Flags? rtmp_main.c: In function ?usb_rtusb_open?: rtmp_main.c:286: error: dereferencing pointer to incomplete type rtmp_main.c:288: error: ?u8? undeclared (first use in this function) rtmp_main.c:288: error: expected ?;? before ?TmpPhy? rtmp_main.c:290: warning: implicit declaration of function ?printk? rtmp_main.c:294: error: ?struct _RTMP_ADAPTER? has no member named ?PortCfg? rtmp_main.c:297: warning: implicit declaration of function ?tasklet_init? rtmp_main.c:331: error: ?u32? undeclared (first use in this function) rtmp_main.c:331: error: expected ?;? before ?MacCsr0? rtmp_main.c:335: error: ?MacCsr0? undeclared (first use in this function) rtmp_main.c:335: error: too many arguments to function ?RTUSBReadMACRegister? rtmp_main.c:341: error: ?Index? undeclared (first use in this function) rtmp_main.c:371: error: ?struct _RTMP_ADAPTER? has no member named ?NicConfig2? rtmp_main.c:373: error: ?struct _RTMP_ADAPTER? has no member named ?BbpTuning? rtmp_main.c:374: error: ?struct _RTMP_ADAPTER? has no member named ?BbpTuning? rtmp_main.c:375: error: ?struct _RTMP_ADAPTER? has no member named ?BbpTuning? rtmp_main.c:376: error: ?struct _RTMP_ADAPTER? has no member named ?BbpTuning? rtmp_main.c:381: error: ?TmpPhy? undeclared (first use in this function) rtmp_main.c:381: error: ?struct _RTMP_ADAPTER? has no member named ?PortCfg? rtmp_main.c:382: error: ?struct _RTMP_ADAPTER? has no member named ?PortCfg? rtmp_main.c:383: error: too many arguments to function ?RTMPSetPhyMode? rtmp_main.c:385: error: ?struct _RTMP_ADAPTER? has no member named ?PortCfg? rtmp_main.c:388: error: ?RateIdToMbps? undeclared (first use in this function) rtmp_main.c:388: error: ?struct _RTMP_ADAPTER? has no member named ?PortCfg? rtmp_main.c:406: error: dereferencing pointer to incomplete type rtmp_main.c:406: error: ?struct _RTMP_ADAPTER? has no member named ?CurrentAddress? rtmp_main.c:406: error: dereferencing pointer to incomplete type rtmp_main.c:410: error: ?struct _RTMP_ADAPTER? has no member named ?Flags? rtmp_main.c:411: error: ?struct _RTMP_ADAPTER? has no member named ?Flags? rtmp_main.c:413: error: ?struct _RTMP_ADAPTER? has no member named ?Flags? rtmp_main.c:416: error: too many arguments to function ?RTUSBWriteMACRegister? rtmp_main.c:418: error: ?struct _RTMP_ADAPTER? has no member named ?PortCfg? rtmp_main.c:418: error: too many arguments to function ?AsicSwitchChannel? rtmp_main.c:419: error: ?struct _RTMP_ADAPTER? has no member named ?PortCfg? rtmp_main.c:419: error: too many arguments to function ?AsicLockChannel? rtmp_main.c:424: error: ?struct _RTMP_ADAPTER? has no member named ?VendorDesc? rtmp_main.c:427: warning: implicit declaration of function ?netif_start_queue? rtmp_main.c:429: warning: implicit declaration of function ?netif_carrier_on? rtmp_main.c:430: warning: implicit declaration of function ?netif_wake_queue? rtmp_main.c:435: error: too many arguments to function ?ReleaseAdapter? rtmp_main.c: In function ?usb_rtusb_close?: rtmp_main.c:788: error: dereferencing pointer to incomplete type rtmp_main.c:792: warning: implicit declaration of function ?DECLARE_WAIT_QUEUE_HEAD? rtmp_main.c:792: error: ?unlink_wakeup? undeclared (first use in this function) rtmp_main.c:793: warning: implicit declaration of function ?DECLARE_WAITQUEUE? rtmp_main.c:793: error: ?wait? undeclared (first use in this function) rtmp_main.c:793: error: ?current? undeclared (first use in this function) rtmp_main.c:797: warning: implicit declaration of function ?netif_carrier_off? rtmp_main.c:798: warning: implicit declaration of function ?netif_stop_queue? rtmp_main.c:801: warning: implicit declaration of function ?add_wait_queue? rtmp_main.c:802: error: ?struct _RTMP_ADAPTER? has no member named ?wait? rtmp_main.c:805: warning: implicit declaration of function ?atomic_read? rtmp_main.c:805: error: ?struct _RTMP_ADAPTER? has no member named ?PendingRx? rtmp_main.c:808: warning: implicit declaration of function ?msleep? rtmp_main.c:812: error: ?struct _RTMP_ADAPTER? has no member named ?wait? rtmp_main.c:813: warning: implicit declaration of function ?remove_wait_queue? rtmp_main.c:815: error: ?struct _RTMP_ADAPTER? has no member named ?MLMEThr_pid? rtmp_main.c:818: error: ?struct _RTMP_ADAPTER? has no member named ?MLMEThr_pid? rtmp_main.c:818: warning: implicit declaration of function ?up? rtmp_main.c:819: warning: implicit declaration of function ?wmb? rtmp_main.c:820: warning: implicit declaration of function ?kill_proc? rtmp_main.c:820: error: ?struct _RTMP_ADAPTER? has no member named ?MLMEThr_pid? rtmp_main.c:820: error: ?SIGTERM? undeclared (first use in this function) rtmp_main.c:823: error: ?KERN_WARNING? undeclared (first use in this function) rtmp_main.c:823: error: expected ?)? before string constant rtmp_main.c:825: warning: implicit declaration of function ?wait_for_completion? rtmp_main.c:827: error: ?struct _RTMP_ADAPTER? has no member named ?MLMEThr_pid? rtmp_main.c:829: error: ?struct _RTMP_ADAPTER? has no member named ?RTUSBCmdThr_pid? rtmp_main.c:832: error: ?struct _RTMP_ADAPTER? has no member named ?RTUSBCmdThr_pid? rtmp_main.c:834: error: ?struct _RTMP_ADAPTER? has no member named ?RTUSBCmdThr_pid? rtmp_main.c:837: error: expected ?)? before string constant rtmp_main.c:841: error: ?struct _RTMP_ADAPTER? has no member named ?RTUSBCmdThr_pid? rtmp_main.c:843: error: too many arguments to function ?RTUSBHalt? rtmp_main.c:845: error: ?struct _RTMP_ADAPTER? has no member named ?Flags? rtmp_main.c:846: warning: implicit declaration of function ?tasklet_kill? rtmp_main.c: In function ?MlmeThread?: rtmp_main.c:858: warning: implicit declaration of function ?daemonize? rtmp_main.c:859: warning: implicit declaration of function ?allow_signal? rtmp_main.c:859: error: ?SIGTERM? undeclared (first use in this function) rtmp_main.c:860: error: ?current? undeclared (first use in this function) rtmp_main.c:862: warning: implicit declaration of function ?complete? rtmp_main.c:873: warning: implicit declaration of function ?down? rtmp_main.c:923: warning: implicit declaration of function ?complete_and_exit? rtmp_main.c: In function ?RTUSBCmdThread?: rtmp_main.c:934: error: ?SIGTERM? undeclared (first use in this function) rtmp_main.c:935: error: ?current? undeclared (first use in this function) rtmp_main.c: At top level: rtmp_main.c:984: warning: ?struct usb_interface? declared inside parameter list rtmp_main.c:985: error: conflicting types for ?usb_rtusb_probe? rtmp_main.c:101: error: previous declaration of ?usb_rtusb_probe? was here rtmp_main.c: In function ?usb_rtusb_probe?: rtmp_main.c:986: warning: implicit declaration of function ?interface_to_usbdev? rtmp_main.c:986: warning: initialization makes pointer from integer without a cast rtmp_main.c:993: warning: implicit declaration of function ?usb_get_dev? rtmp_main.c:996: error: dereferencing pointer to incomplete type rtmp_main.c:997: error: dereferencing pointer to incomplete type rtmp_main.c:999: error: dereferencing pointer to incomplete type rtmp_main.c:999: error: dereferencing pointer to incomplete type rtmp_main.c:1008: warning: implicit declaration of function ?alloc_etherdev? rtmp_main.c:1008: warning: assignment makes pointer from integer without a cast rtmp_main.c:1015: error: dereferencing pointer to incomplete type rtmp_main.c:1015: warning: implicit declaration of function ?vmalloc? rtmp_main.c:1016: error: dereferencing pointer to incomplete type rtmp_main.c:1020: warning: implicit declaration of function ?free_netdev? rtmp_main.c:1025: error: too many arguments to function ?RTMPZeroMemory? rtmp_main.c:1028: error: dereferencing pointer to incomplete type rtmp_main.c:1030: warning: implicit declaration of function ?SET_MODULE_OWNER? rtmp_main.c:1031: warning: implicit declaration of function ?ether_setup? rtmp_main.c:1033: error: dereferencing pointer to incomplete type rtmp_main.c:1034: error: dereferencing pointer to incomplete type rtmp_main.c:1035: error: dereferencing pointer to incomplete type rtmp_main.c:1036: error: dereferencing pointer to incomplete type rtmp_main.c:1037: error: dereferencing pointer to incomplete type rtmp_main.c:1043: error: dereferencing pointer to incomplete type rtmp_main.c:1045: error: dereferencing pointer to incomplete type rtmp_main.c:1046: error: dereferencing pointer to incomplete type rtmp_main.c:1047: error: dereferencing pointer to incomplete type rtmp_main.c:1048: error: dereferencing pointer to incomplete type rtmp_main.c:1050: error: ?struct _RTMP_ADAPTER? has no member named ?PortCfg? rtmp_main.c:1052: error: ?struct _RTMP_ADAPTER? has no member named ?MLMEThr_pid? rtmp_main.c:1053: error: ?struct _RTMP_ADAPTER? has no member named ?RTUSBCmdThr_pid? rtmp_main.c:1055: warning: implicit declaration of function ?SET_NETDEV_DEV? rtmp_main.c:1055: error: dereferencing pointer to incomplete type rtmp_main.c:1067: warning: implicit declaration of function ?sprintf? rtmp_main.c:1067: warning: incompatible implicit declaration of built-in function ?sprintf? rtmp_main.c:1070: warning: implicit declaration of function ?dev_get_by_name? rtmp_main.c:1070: warning: comparison between pointer and integer rtmp_main.c:1092: warning: incompatible implicit declaration of built-in function ?sprintf? rtmp_main.c:1092: error: dereferencing pointer to incomplete type rtmp_main.c:1097: error: dereferencing pointer to incomplete type rtmp_main.c:1100: error: dereferencing pointer to incomplete type rtmp_main.c:1103: error: ?struct _RTMP_ADAPTER? has no member named ?BulkOutMaxPacketSize? rtmp_main.c:1103: error: ?u16? undeclared (first use in this function) rtmp_main.c:1103: error: expected ?;? before ?endpoint? rtmp_main.c:1060: warning: unused variable ?device? rtmp_main.c:1110: warning: implicit declaration of function ?register_netdev? rtmp_main.c:1114: warning: implicit declaration of function ?usb_set_intfdata? rtmp_main.c:1116: error: ?struct _RTMP_ADAPTER? has no member named ?Flags? rtmp_main.c: At top level: rtmp_main.c:1127: warning: ?struct usb_interface? declared inside parameter list rtmp_main.c:1128: error: conflicting types for ?usb_rtusb_disconnect? rtmp_main.c:103: error: previous declaration of ?usb_rtusb_disconnect? was here rtmp_main.c: In function ?usb_rtusb_disconnect?: rtmp_main.c:1130: warning: initialization makes pointer from integer without a cast rtmp_main.c:1133: warning: implicit declaration of function ?usb_get_intfdata? rtmp_main.c:1133: warning: assignment makes pointer from integer without a cast rtmp_main.c:1136: error: ?struct _RTMP_ADAPTER? has no member named ?Flags? rtmp_main.c:1143: warning: implicit declaration of function ?udelay? rtmp_main.c:1151: warning: implicit declaration of function ?unregister_netdev? rtmp_main.c:1154: warning: implicit declaration of function ?flush_scheduled_work? rtmp_main.c:1158: warning: implicit declaration of function ?vfree? rtmp_main.c:1163: warning: implicit declaration of function ?usb_put_dev? rtmp_main.c: At top level: rtmp_main.c:1174: error: expected ?=?, ?,?, ?;?, ?asm? or ?__attribute__? before ?usb_rtusb_init? rtmp_main.c:1184: error: expected ?=?, ?,?, ?;?, ?asm? or ?__attribute__? before ?usb_rtusb_exit? rtmp_main.c:1193: warning: data definition has no type or storage class rtmp_main.c:1193: warning: type defaults to ?int? in declaration of ?module_init? rtmp_main.c:1193: warning: parameter names (without types) in function declaration rtmp_main.c:1194: warning: data definition has no type or storage class rtmp_main.c:1194: warning: type defaults to ?int? in declaration of ?module_exit? rtmp_main.c:1194: warning: parameter names (without types) in function declaration make: *** [rtmp_main.o] Błąd 1 [root@localhost Module]# To chyba wszystko z naszej konwersacji. I oczywiście ja tu się zacinam. :lammer: :lammer: :lammer: Odnośnik do komentarza Udostępnij na innych stronach More sharing options...
morsik Napisano Marzec 21, 2008 Zgłoszenie Share Napisano Marzec 21, 2008 a patrzyłas w repozytoriach czy może są sterowniki do tej sieciowki? możesz podać chip na którym to siedzi? (akurat zapomniałem jak to się fachowa nazywało ale chodzi mi o te ralink, zd1211 lub podobnie) co do błędu, nie znam się na kompilowaniu zabardzo, ale tu jest błąd 1 a nie jak pisałas wyżej - 2 Odnośnik do komentarza Udostępnij na innych stronach More sharing options...
ciebanna Napisano Marzec 21, 2008 Autor Zgłoszenie Share Napisano Marzec 21, 2008 Tak. Bład 1. A chipset ralink. Dzięki za zainteresowanie. Odnośnik do komentarza Udostępnij na innych stronach More sharing options...
@WalDo Napisano Marzec 21, 2008 Zgłoszenie Share Napisano Marzec 21, 2008 Tu daję enter i powracam do:Zamiast enter daj "y" i dopiero enter plik Makefile.6 ma napisać Makefile. Domyslna akcja to zaniechanie nadpisywania. Stąd błędy. [EDIT]Na wszelki wypadek daj polecenie ls -l Makefile* Wielkości plików Makefile.6 i Makefile powinny być po nadpisaniu identyczne. Wielkość pokazuje się w kolumnie przed datą. Dopiero jak będa identyczne wielkości to "make all". Odnośnik do komentarza Udostępnij na innych stronach More sharing options...
morsik Napisano Marzec 22, 2008 Zgłoszenie Share Napisano Marzec 22, 2008 ei ludzie! przecież jest w repo ralink-firmware-usb, czy coś takiego, wiem bo kiedyś instalowałem szukając sposobu na moja sieciowe ciebanna: daj "yum search ralink" i w wynikach dostaniesz coś z końcówka usb, następnie "yum install <to co miałaś w wyniku>" (z postów wcześniej rozumiem że masz neta z kabla) Odnośnik do komentarza Udostępnij na innych stronach More sharing options...
ciebanna Napisano Marzec 22, 2008 Autor Zgłoszenie Share Napisano Marzec 22, 2008 Dzięki, będę próbować. Spokojnych Świąt dla wszystkich Forumowiczów. Odnośnik do komentarza Udostępnij na innych stronach More sharing options...
ciebanna Napisano Marzec 25, 2008 Autor Zgłoszenie Share Napisano Marzec 25, 2008 Serdecznie dziekuję WalDo. Zrobiłam po kolei i niestety znów błąd: [root@localhost Module]# cp Makefile.6 ./Makefile cp: zamazać `./Makefile'? y [root@localhost Module]# ls -l Makefile* -r-xr-xr-x 1 root root 1641 mar 25 12:03 Makefile -r-xr-xr-x 1 root root 1898 kwi 26 2007 Makefile.4 -r-xr-xr-x 1 root root 1641 kwi 26 2007 Makefile.6 [root@localhost Module]# make all make -C /lib/modules/2.6.23.14-115.fc8/build SUBDIRS=/root/RT73_Linux_STA_Drv1.0.4.0/Module modules make: *** /lib/modules/2.6.23.14-115.fc8/build: Nie ma takiego pliku ani katalogu. Stop. make: *** [all] Błąd 2 [root@localhost Module]# Pliki są takiej samej wielkości Wpisałam jeszcze polecenie iwconfig i otrzymałam taki wynik: [root@localhost ~]# iwconfig lo no wireless extensions. eth0 no wireless extensions. wmaster0 no wireless extensions. wlan0 IEEE 802.11g ESSID:"" Mode:Managed Channel:0 Access Point: Not-Associated Tx-Power=0 dBm Retry min limit:7 RTS thr:off Fragment thr=2352 B Encryption key:off Link Quality:0 Signal level:0 Noise level:0 Rx invalid nwid:0 Rx invalid crypt:0 Rx invalid frag:0 Tx excessive retries:0 Invalid misc:0 Missed beacon:0 Rozumiem, że system "widzi"kartę ale nic z tego nie wynika? Czy jest to tylko kwestia skonfigurowania czy nadal brakuje sterowników? Pozdrawiam Anna Odnośnik do komentarza Udostępnij na innych stronach More sharing options...
@WalDo Napisano Marzec 25, 2008 Zgłoszenie Share Napisano Marzec 25, 2008 make: *** /lib/modules/2.6.23.14-115.fc8/build: Nie ma takiego pliku ani katalogu. Stop. yum install kernel-devel kernel-headers i jeszcze raz Odnośnik do komentarza Udostępnij na innych stronach More sharing options...
ciebanna Napisano Marzec 25, 2008 Autor Zgłoszenie Share Napisano Marzec 25, 2008 Spróbowałam. Niestety: Installed: kernel-devel.i686 0:2.6.24.3-34.fc8 Complete! [root@localhost ~]# cd ./RT73_Linux_STA_Drv1.0.4.0/Module [root@localhost Module]# cp Makefile.6 ./Makefile cp: zamazać `./Makefile'? y [root@localhost Module]# make all make -C /lib/modules/2.6.23.14-115.fc8/build SUBDIRS=/root/RT73_Linux_STA_Drv1.0.4.0/Module modules make: *** /lib/modules/2.6.23.14-115.fc8/build: Nie ma takiego pliku ani katalogu. Stop. make: *** [all] Błąd 2 Przypuszczam, że chodzi o drobną różnicę w cyfrach : ściągnełam kernel - devel i686 0:2.6.24.3-34.fc8 a mam plecenia dla 6.6.23.14-115.fc8 - czy to jest ten problem? Czy da się coś z tm zrobić? Odnośnik do komentarza Udostępnij na innych stronach More sharing options...
@WalDo Napisano Marzec 25, 2008 Zgłoszenie Share Napisano Marzec 25, 2008 Czy da się coś z tm zrobić?Coś masz pomieszane z tymi kernelami :\ Pokaż co dają polecenia rpm -qa | grep kernel uname -a Odnośnik do komentarza Udostępnij na innych stronach More sharing options...
Adi1981 Napisano Marzec 25, 2008 Zgłoszenie Share Napisano Marzec 25, 2008 yum update kernel\* && reboot Po przelogowaniu wybierz najnowszy kernel. Lub ewentualnie wymuś zainstalowanie dla obecnej wersji przez yum update kernel-devel-`uname -r` kernel-headers-`uname -r` Odnośnik do komentarza Udostępnij na innych stronach More sharing options...
ciebanna Napisano Marzec 25, 2008 Autor Zgłoszenie Share Napisano Marzec 25, 2008 Coś masz pomieszane z tymi kernelami :\ Pokaż co dają polecenia rpm -qa | grep kernel uname -a $ rpm -qa | grep kernel: kernel-devel-2.6.24.3-34.fc8 kernel-2.6.23.1-42.fc8 kernel-2.6.23.14-115.fc8 kernel-headers-2.6.24.3-34.fc8 $ uname -a: Linux localhost.localdomain 2.6.23.14-115.fc8 #1 SMP Mon Jan 21 14:20:50 EST 2008 i686 i686 i386 GNU/Linux Odnośnik do komentarza Udostępnij na innych stronach More sharing options...
Adi1981 Napisano Marzec 25, 2008 Zgłoszenie Share Napisano Marzec 25, 2008 yum update kernel\* && reboot Odnośnik do komentarza Udostępnij na innych stronach More sharing options...
ciebanna Napisano Marzec 25, 2008 Autor Zgłoszenie Share Napisano Marzec 25, 2008 A miało być tak pieknie. Zacz ęło się nieźle, ale niestety: [root@systemy46 Module]# make all make -C /lib/modules/2.6.24.3-34.fc8/build SUBDIRS=/root/RT73_Linux_STA_Drv1.0.4.0/Module modules make[1]: Wejście do katalogu `/usr/src/kernels/2.6.24.3-34.fc8-i686' scripts/Makefile.build:46: *** CFLAGS was changed in "/root/RT73_Linux_STA_Drv1.0.4.0/Module/Makefile". Fix it to use EXTRA_CFLAGS. Stop. make[1]: *** [_module_/root/RT73_Linux_STA_Drv1.0.4.0/Module] Błąd 2 make[1]: Opuszczenie katalogu `/usr/src/kernels/2.6.24.3-34.fc8-i686' make: *** [all] Błąd 2 [root@systemy46 Module]# Jeszcze raz ściągnęłam więc sterownik, rozpakowałam,,wykonałam po kolei polecenia i momo to pojawia sie w.w komunikat. Przecież ja nic nie zmieniam w tym pliku root/RT73_Linux_STA_Drv1.0.4.0/Module/Makefile.... Odnośnik do komentarza Udostępnij na innych stronach More sharing options...
morsik Napisano Marzec 25, 2008 Zgłoszenie Share Napisano Marzec 25, 2008 Nie rozumiem... ciebanna: dla pewności wykonaj: yum install rt73usb-firmware Potem: iwconfig Jeśli nie wyświetli no wirelless extensions przy wlan0 to znaczy że jest wykryta, teraz wystarczy tylko wybrać sieć. Włącz dla pewności te usługi: service network start service NetworkManager start service NetworkManagerDispatcher start service dhcpd start Jeśli zobaczysz [bŁĄD] przy jakiejś usłudze to znaczy że na 99,9% taka usługa jest już uruchomiona. Następnie uruchom nm-applet z usera (Wciśnij Alt+F2 i wpisz). W tacce systemowej się pojawi nowy aplet (chyba dwa monitory), kliknij lewym przyciskiem myszy i wybierz sieć bezprzewodową. Powinny być widoczne wykryte sieci w tym menu. Jeśli nie ma to daj Połącz z siecią przewodową (tak przewodową bo ktoś źle przetłumaczył, oczywiście chodzi tu o bezprzewodową) i wpisz ręcznie SSID sieci. To tak najprościej Odnośnik do komentarza Udostępnij na innych stronach More sharing options...
Rekomendowane odpowiedzi
Jeśli chcesz dodać odpowiedź, zaloguj się lub zarejestruj nowe konto
Jedynie zarejestrowani użytkownicy mogą komentować zawartość tej strony.
Zarejestruj nowe konto
Załóż nowe konto. To bardzo proste!
Zarejestruj sięZaloguj się
Posiadasz już konto? Zaloguj się poniżej.
Zaloguj się